{
  "assets/js/pack.js": "assets/js/pack.4ced2556b94e5c09e5bc.js",
  "assets/js/pack.js.map": "assets/js/pack.4ced2556b94e5c09e5bc.js.map",
  "sw.js": "sw.4ced2556b94e5c09e5bc.js",
  "sw.js.map": "sw.4ced2556b94e5c09e5bc.js.map"
}