<?xml version="1.0" encoding="UTF-8" standalone="no"?>
<svg
   xmlns:dc="http://purl.org/dc/elements/1.1/"
   xmlns:cc="http://creativecommons.org/ns#"
   xmlns:rdf="http://www.w3.org/1999/02/22-rdf-syntax-ns#"
   xmlns:svg="http://www.w3.org/2000/svg"
   xmlns="http://www.w3.org/2000/svg"
   id="svg1479"
   version="1.1"
   viewBox="0 0 26.458333 26.458334"
>
  <defs
     id="defs1473" />
  <metadata
     id="metadata1476">
    <rdf:RDF>
      <cc:Work
         rdf:about="">
        <dc:format>image/svg+xml</dc:format>
        <dc:type
           rdf:resource="http://purl.org/dc/dcmitype/StillImage" />
        <dc:title></dc:title>
      </cc:Work>
    </rdf:RDF>
  </metadata>
  <g
     transform="translate(0,-270.54165)"
     id="layer1">
    <g
       transform="matrix(4.927345,0,0,4.927345,-1958.7897,-644.10978)"
       id="g4483">
      <g
         id="g4485"
         transform="matrix(1.4155491,0,0,1.4155491,-164.58102,-85.505748)"
         style="fill:#ff0000;stroke:#ab00ff;stroke-opacity:1">
        <path
           transform="matrix(0.28222223,0,0,0.28222223,-1.3919578e-6,0)"
           id="path4487"
           d="m 1408.0915,690.9305 v 0 l 11.3574,-10.68929"
           style="fill:#ff0000;stroke:#ff0000;stroke-width:2.0622046;stroke-linecap:round;stroke-linejoin:round;stroke-miterlimit:4;stroke-dasharray:none;stroke-opacity:1" />
        <path
           style="fill:#ff0000;stroke:#ff0000;stroke-width:0.58199996;stroke-linecap:round;stroke-linejoin:round;stroke-miterlimit:4;stroke-dasharray:none;stroke-opacity:1"
           d="m 400.60003,194.99595 v 0 l -3.20531,-3.01676"
           id="path4489" />
      </g>
      <g
         id="g4491"
         transform="translate(-3.6766711,-6.5363042)">
        <path
           d="m 405.19431,193.36425 v -0.11209 c 0,-0.45158 -0.41956,-0.79409 -0.85983,-0.67869 -0.26537,-0.51255 -0.97425,-0.49133 -1.22165,0.008 -0.42743,-0.10936 -0.85326,0.2167 -0.85326,0.67286 v 1.30602 c -0.2066,-0.0769 -0.44843,-0.0525 -0.64284,0.0918 -0.30395,0.22569 -0.37063,0.65579 -0.15065,0.96456 l 1.24221,1.74386 c 0.061,0.0856 0.16475,0.13908 0.26987,0.13908 h 2.30798 c 0.15433,0 0.28822,-0.10654 0.32288,-0.25693 l 0.31254,-1.356 c 0.0357,-0.15492 0.0538,-0.31388 0.0538,-0.47285 v -1.36229 c 0,-0.4206 -0.36782,-0.74544 -0.78104,-0.68711 z"
           id="path4493"
           style="fill:#ffffff" />
        <path
           style="fill:#000000"
           id="path4495"
           d="m 405.19431,193.36425 v -0.11209 c 0,-0.45158 -0.41956,-0.79409 -0.85983,-0.67869 -0.26537,-0.51255 -0.97425,-0.49133 -1.22165,0.008 -0.42743,-0.10936 -0.85326,0.2167 -0.85326,0.67286 v 1.30602 c -0.2066,-0.0769 -0.44843,-0.0525 -0.64284,0.0918 -0.30395,0.22569 -0.37063,0.65579 -0.15065,0.96456 l 1.24221,1.74386 a 0.33134442,0.33134442 0 0 0 0.26987,0.13908 h 2.30798 c 0.15433,0 0.28822,-0.10654 0.32288,-0.25693 l 0.31254,-1.356 a 2.108562,2.108562 0 0 0 0.0538,-0.47285 v -1.36229 c 0,-0.4206 -0.36782,-0.74544 -0.78104,-0.68711 z m 0.284,2.04939 c 0,0.12147 -0.0138,0.24301 -0.0411,0.36123 l -0.28293,1.22753 h -2.09079 l -1.1928,-1.67429 c -0.14951,-0.20989 0.15555,-0.44293 0.30436,-0.23406 l 0.2809,0.39429 c 0.0931,0.13073 0.3006,0.0651 0.3006,-0.0961 v -2.13815 c 0,-0.26555 0.37867,-0.2569 0.37867,0.007 v 1.58744 c 0,0.0915 0.0742,0.16567 0.16568,0.16567 h 0.071 c 0.0915,0 0.16568,-0.0742 0.16568,-0.16567 v -1.957 c 0,-0.26573 0.37867,-0.2569 0.37867,0.007 v 1.94985 c 0,0.0915 0.0742,0.16567 0.16567,0.16567 h 0.071 c 0.0915,0 0.16567,-0.0742 0.16567,-0.16567 v -1.60365 c 0,-0.26582 0.37866,-0.2569 0.37866,0.007 v 1.5965 c 0,0.0915 0.0742,0.16567 0.16568,0.16567 h 0.071 c 0.0915,0 0.16567,-0.0742 0.16567,-0.16567 v -0.79014 c 0,-0.27173 0.37866,-0.26549 0.37866,-0.007 v 1.36227 z" />
      </g>
    </g>
  </g>
</svg>
