Merge branch 'codespell-ignore-words' into 'master'

Add some more words to be ignored by codespell

See merge request !292
12 jobs for master in 16 minutes and 37 seconds (queued for 2 seconds)
latest
Status Job ID Name Coverage
  Static
passed #102858
codespell

00:00:27

 
  Test
passed #102864
bundler:audit

00:01:31

passed #102859
ruby:2.1

00:05:39

83.1%
passed #102860
ruby:2.2

00:05:17

82.73%
passed #102861
ruby:2.3

00:09:11

82.43%
passed #102862
ruby:2.4

00:04:42

82.6%
passed #102863
ruby:2.5

00:02:55

82.52%
 
  Debian:Build
failed #102865
allowed to fail
debian:build

00:02:37

 
  Debian:Qa
failed #102866
allowed to fail
debian:autopkgtest

00:00:41

failed #102867
allowed to fail
debian:lintian

00:01:13

failed #102868
allowed to fail
debian:piuparts

00:01:03

 
  Docker
passed #102869
docker-in-docker
build_docker_image

00:02:27

 
Name Stage Failure
failed
debian:lintian Debian:Qa
Setting up libemail-valid-perl (1.202-1) ...
Setting up libimport-into-perl (1.002005-1) ...
Setting up libmoo-perl (2.003004-2) ...
Setting up libxml-simple-perl (2.25-1) ...
Setting up lintian (2.16.0) ...
Processing triggers for libc-bin (2.28-10) ...
$ lintian --allow-root --display-experimental --display-info --info --pedantic results/*.changes
bad package file name results/*.changes (neither .deb, .udeb, .changes .dsc or .buildinfo file)
ERROR: Job failed: exit code 1
failed
debian:piuparts Debian:Qa
0m0.0s INFO: Running on: Linux runner-EyYDB4La-project-493-concurrent-2 4.9.0-8-amd64 #1 SMP Debian 4.9.144-3.1 (2019-02-19) x86_64
0m0.0s DEBUG: Starting command: ['dpkg', '--info', 'results/*.deb']
0m0.0s DUMP:
dpkg-deb: error: failed to read archive 'results/*.deb': No such file or directory
0m0.0s ERROR: Command failed (status=2): ['dpkg', '--info', 'results/*.deb']
dpkg-deb: error: failed to read archive 'results/*.deb': No such file or directory

0m0.0s ERROR: piuparts run ends.
ERROR: Job failed: exit code 1
failed
debian:autopkgtest Debian:Qa
Setting up python3-pkg-resources (41.0.1-1) ...
Setting up python3-chardet (3.0.4-3) ...
Setting up python3-debian (0.1.35) ...
Setting up autopkgtest (5.10) ...
Processing triggers for libc-bin (2.28-10) ...
$ eatmydata autopkgtest results/*.dsc -- null
usage: autopkgtest [options] [testbinary ...] testsrc -- virt-server [options]
autopkgtest: error: results/*.dsc is not a valid test package
ERROR: Job failed: exit code 1
failed
debian:build Debian:Build
/usr/bin/ruby2.5 /usr/bin/rspec --format documentation failed
ERROR: Test "ruby2.5" failed. Exiting.
dh_auto_install: dh_ruby --install /builds/schleuder/schleuder/debian/schleuder returned exit code 1
make: *** [debian/rules:7: binary] Error 255
dpkg-buildpackage: error: debian/rules binary subprocess returned exit status 2
debuild: fatal error at line 1182:
dpkg-buildpackage -us -uc -ui -i -I failed
gbp:error: 'debuild -i -I -us -uc --lintian-opts --no-lintian' failed: it exited with 29
ERROR: Job failed: exit code 1