Merge branch 'paz/do-not-ask-for-passphrase' into 'master'

Do not ask for a passphrase ever when running tests.

Closes #448

See merge request !316
14 jobs for master in 26 minutes and 35 seconds (queued for 1 second)
Status Job ID Name Coverage
  Static
passed #129621
codespell

00:00:34

 
  Test
passed #129629
bundler:audit

00:04:06

passed #129622
ruby:2.1

00:06:57

83.14%
passed #129623
ruby:2.2

00:05:57

83.37%
passed #129624
ruby:2.3

00:11:22

82.86%
passed #129625
ruby:2.4

00:04:19

82.56%
passed #129626
ruby:2.5

00:07:39

82.79%
passed #129627
ruby:2.6

00:06:29

82.82%
passed #129628
ruby:2.7

00:12:12

82.82%
 
  Debian:Build
failed #129630
allowed to fail
debian:build

00:02:55

 
  Debian:Qa
failed #129631
allowed to fail
debian:autopkgtest

00:00:31

failed #129632
allowed to fail
debian:lintian

00:01:02

failed #129633
allowed to fail
debian:piuparts

00:00:59

 
  Docker
passed #129634
docker-in-docker
build_docker_image

00:03:10

 
Name Stage Failure
failed
debian:lintian Debian:Qa
Setting up libmoo-perl (2.003006-1) ...
Setting up libmoox-aliases-perl (0.001006-1) ...
Setting up libb-hooks-endofscope-perl (0.24-1) ...
Setting up libnamespace-clean-perl (0.27-1) ...
Setting up lintian (2.50.0) ...
Processing triggers for libc-bin (2.29-9) ...
$ lintian --allow-root --display-experimental --display-info --info --pedantic results/*.changes
bad package file name results/*.changes (neither .deb, .udeb, .changes, .dsc or .buildinfo file)
ERROR: Job failed: exit code 1
failed
debian:piuparts Debian:Qa
0m0.0s INFO: Running on: Linux runner-17b7d579-project-493-concurrent-2 4.9.0-8-amd64 #1 SMP Debian 4.9.144-3.1 (2019-02-19) x86_64
0m0.0s DEBUG: Starting command: ['dpkg', '--info', 'results/*.deb']
0m0.0s DUMP:
dpkg-deb: error: failed to read archive 'results/*.deb': No such file or directory
0m0.0s ERROR: Command failed (status=2): ['dpkg', '--info', 'results/*.deb']
dpkg-deb: error: failed to read archive 'results/*.deb': No such file or directory

0m0.0s ERROR: piuparts run ends.
ERROR: Job failed: exit code 1
failed
debian:autopkgtest Debian:Qa
Setting up python3-pkg-resources (44.0.0-1) ...
Setting up python3-chardet (3.0.4-4) ...
Setting up python3-debian (0.1.36) ...
Setting up autopkgtest (5.11) ...
Processing triggers for libc-bin (2.29-9) ...
$ eatmydata autopkgtest results/*.dsc -- null
usage: autopkgtest [options] [testbinary ...] testsrc -- virt-server [options]
autopkgtest: error: results/*.dsc is not a valid test package
ERROR: Job failed: exit code 1
failed
debian:build Debian:Build
/usr/bin/ruby2.5 /usr/bin/rspec --format documentation failed
ERROR: Test "ruby2.5" failed. Exiting.
dh_auto_install: error: dh_ruby --install /builds/schleuder/schleuder/debian/schleuder returned exit code 1
make: *** [debian/rules:7: binary] Error 25
dpkg-buildpackage: error: debian/rules binary subprocess returned exit status 2
debuild: fatal error at line 1182:
dpkg-buildpackage -us -uc -ui -i -I failed
gbp:error: 'debuild -i -I -us -uc --lintian-opts --no-lintian' failed: it exited with 29
ERROR: Job failed: exit code 1