Merge branch 'ruby-2.7-master' into 'master'

Ruby 2.7 master

See merge request !317
13 jobs for master in 13 minutes and 30 seconds (queued for 2 seconds)
Status Job ID Name Coverage
  Static
passed #127016
codespell

00:00:24

 
  Test
passed #127017
ruby:2.1

00:05:41

83.43%
passed #127018
ruby:2.2

00:05:36

83.1%
passed #127019
ruby:2.3

00:07:59

82.84%
passed #127020
ruby:2.4

00:04:39

82.84%
passed #127021
ruby:2.5

00:03:29

82.9%
passed #127022
ruby:2.6

00:04:34

82.89%
passed #127023
ruby:2.7

00:04:32

82.93%
 
  Debian:Build
failed #127024
allowed to fail
debian:build

00:01:19

 
  Debian:Qa
failed #127025
allowed to fail
debian:autopkgtest

00:00:33

failed #127026
allowed to fail
debian:lintian

00:00:53

failed #127027
allowed to fail
debian:piuparts

00:01:02

 
  Docker
passed #127028
docker-in-docker
build_docker_image

00:02:42

 
Name Stage Failure
failed
debian:piuparts Debian:Qa
0m0.0s INFO: Running on: Linux runner-17b7d579-project-493-concurrent-2 4.9.0-8-amd64 #1 SMP Debian 4.9.144-3.1 (2019-02-19) x86_64
0m0.0s DEBUG: Starting command: ['dpkg', '--info', 'results/*.deb']
0m0.0s DUMP:
dpkg-deb: error: failed to read archive 'results/*.deb': No such file or directory
0m0.0s ERROR: Command failed (status=2): ['dpkg', '--info', 'results/*.deb']
dpkg-deb: error: failed to read archive 'results/*.deb': No such file or directory

0m0.0s ERROR: piuparts run ends.
ERROR: Job failed: exit code 1
failed
debian:lintian Debian:Qa
Setting up libmoo-perl (2.003006-1) ...
Setting up libmoox-aliases-perl (0.001006-1) ...
Setting up libb-hooks-endofscope-perl (0.24-1) ...
Setting up libnamespace-clean-perl (0.27-1) ...
Setting up lintian (2.46.0) ...
Processing triggers for libc-bin (2.29-6) ...
$ lintian --allow-root --display-experimental --display-info --info --pedantic results/*.changes
bad package file name results/*.changes (neither .deb, .udeb, .changes, .dsc or .buildinfo file)
ERROR: Job failed: exit code 1
failed
debian:autopkgtest Debian:Qa
Setting up python3-pkg-resources (44.0.0-1) ...
Setting up python3-chardet (3.0.4-4) ...
Setting up python3-debian (0.1.36) ...
Setting up autopkgtest (5.11) ...
Processing triggers for libc-bin (2.29-6) ...
$ eatmydata autopkgtest results/*.dsc -- null
usage: autopkgtest [options] [testbinary ...] testsrc -- virt-server [options]
autopkgtest: error: results/*.dsc is not a valid test package
ERROR: Job failed: exit code 1
failed
debian:build Debian:Build
/usr/bin/ruby2.5 /usr/bin/rspec --format documentation failed
ERROR: Test "ruby2.5" failed. Exiting.
dh_auto_install: error: dh_ruby --install /builds/schleuder/schleuder/debian/schleuder returned exit code 1
make: *** [debian/rules:7: binary] Error 25
dpkg-buildpackage: error: debian/rules binary subprocess returned exit status 2
debuild: fatal error at line 1182:
dpkg-buildpackage -us -uc -ui -i -I failed
gbp:error: 'debuild -i -I -us -uc --lintian-opts --no-lintian' failed: it exited with 29
ERROR: Job failed: exit code 1