<?xml version="1.0" encoding="UTF-8" standalone="no"?>
<!-- Created with Inkscape (http://www.inkscape.org/) -->
<svg
   xmlns:dc="http://purl.org/dc/elements/1.1/"
   xmlns:cc="http://creativecommons.org/ns#"
   xmlns:rdf="http://www.w3.org/1999/02/22-rdf-syntax-ns#"
   xmlns:svg="http://www.w3.org/2000/svg"
   xmlns="http://www.w3.org/2000/svg"
   xmlns:sodipodi="http://sodipodi.sourceforge.net/DTD/sodipodi-0.dtd"
   xmlns:inkscape="http://www.inkscape.org/namespaces/inkscape"
   width="708"
   height="794"
   id="svg2708"
   sodipodi:version="0.32"
   inkscape:version="0.92.3 (2405546, 2018-03-11)"
   version="1.0"
   sodipodi:docname="bg.svg"
   inkscape:output_extension="org.inkscape.output.svg.inkscape"
   style="">
  <defs
     id="defs2710">
    <inkscape:perspective
       sodipodi:type="inkscape:persp3d"
       inkscape:vp_x="0 : 526.18109 : 1"
       inkscape:vp_y="0 : 1000 : 0"
       inkscape:vp_z="744.09448 : 526.18109 : 1"
       inkscape:persp3d-origin="372.04724 : 350.78739 : 1"
       id="perspective2716" />
  </defs>
  <sodipodi:namedview
     id="base"
     pagecolor="#ffffff"
     bordercolor="#666666"
     borderopacity="1.0"
     gridtolerance="10000"
     guidetolerance="10"
     objecttolerance="10"
     inkscape:pageopacity="0.0"
     inkscape:pageshadow="2"
     inkscape:zoom="1.15"
     inkscape:cx="444.82249"
     inkscape:cy="487.45753"
     inkscape:document-units="px"
     inkscape:current-layer="g3622"
     showgrid="false"
     units="in"
     borderlayer="false"
     inkscape:showpageshadow="false"
     inkscape:window-width="1920"
     inkscape:window-height="989"
     inkscape:window-x="0"
     inkscape:window-y="0"
     showguides="true"
     inkscape:guide-bbox="true"
     inkscape:window-maximized="1" />
  <metadata
     id="metadata2713">
    <rdf:RDF>
      <cc:Work
         rdf:about="">
        <dc:format>image/svg+xml</dc:format>
        <dc:type
           rdf:resource="http://purl.org/dc/dcmitype/StillImage" />
        <dc:title />
      </cc:Work>
    </rdf:RDF>
  </metadata>
  <g
     inkscape:label="bottom"
     inkscape:groupmode="layer"
     id="layer1"
     style=""
     transform="translate(0,-196)">
    <g
       id="g3622"
       transform="translate(-25.217391,36.521739)">
      <path
         d="m 527.41918,439.83568 12.65695,-4.24843 33.7519,-2.13184 33.75186,-2.13207 12.24693,-6.2951 12.24698,-6.2951 17.28592,-16.03168 c 9.50732,-8.81733 22.09411,-19.68011 27.97075,-24.1394 l 10.68475,-8.10769 24.16858,-9.09128 24.16839,-9.09112 -22.87972,-6.84392 -13.62886,-1.35191 -11.80461,-4.33423 -9.29031,1.59796 c -5.10966,0.87902 -13.21977,2.40765 -18.02237,3.39704 l -8.73205,1.79909 -4.89272,-12.21295 c -2.69101,-6.71722 -6.67216,-21.50064 -8.84708,-32.85226 l -3.95431,-20.63911 V 267.19889 253.5661 l -2.54422,-6.69181 -2.54415,-6.6916 -24.10939,-17.51668 c -13.26011,-9.63415 -30.62214,-23.86022 -38.58221,-31.61368 l -14.4729,-14.09701 1.73723,6.92173 c 0.95548,3.80704 2.56566,9.25432 3.57824,12.10533 l 1.84098,5.18341 -10.26645,-9.69253 c -5.64655,-5.33073 -13.61898,-14.53005 -17.71649,-20.44274 -4.09744,-5.91268 -7.97798,-10.22226 -8.62331,-9.57696 -1.12657,1.12658 3.25693,19.70472 6.8721,29.12582 l 1.73886,4.53136 -4.70834,-1.80683 -4.70835,-1.80663 4.22008,10.09976 c 2.32102,5.55509 4.22,11.28571 4.22,12.73514 v 2.63518 l -3.01983,-1.86639 -3.01986,-1.86639 5.8897,11.54462 c 3.2393,6.3497 5.40611,11.54482 4.81518,11.54482 -0.59098,0 -9.3509,-3.75283 -19.46655,-8.33939 l -18.39212,-8.33939 -18.56149,-14.04916 c -10.20884,-7.72706 -18.56149,-13.40426 -18.56149,-12.61581 0,0.78825 1.93106,5.16732 4.29119,9.73144 l 4.29122,8.2983 h -2.66472 c -1.46563,0 -11.15849,-5.69567 -21.53963,-12.65692 -10.38114,-6.96124 -19.36583,-12.65691 -19.96589,-12.65691 -1.85845,0 10.66871,23.60449 15.52379,29.25092 l 4.59444,5.34323 -7.93824,-1.93211 -7.9382,-1.93211 7.9382,10.12001 c 4.36603,5.56601 13.00101,13.9884 19.18887,18.71653 l 11.2506,8.59651 -8.43794,-1.94105 -8.43797,-1.94084 9.39731,9.74435 c 5.1685,5.35932 13.71196,12.068 18.98543,14.90789 5.27347,2.83989 9.58813,6.2266 9.58813,7.52612 v 2.36257 l -5.62532,-1.78538 -5.62532,-1.78538 v 2.58138 2.58137 l 18.9854,9.15187 c 10.44201,5.0337 20.88401,10.09442 23.20444,11.24619 2.32046,1.15182 6.09464,5.76618 8.38696,10.25426 2.29243,4.48807 7.5256,13.85576 11.62931,20.817 l 7.46133,12.6571 3.46037,14.94421 3.46037,14.94426 -6.60371,7.02932 c -3.632,3.86621 -10.52828,9.45488 -15.32505,12.41944 l -8.72125,5.39012 -20.34033,4.2786 c -11.18715,2.35322 -24.37106,4.29806 -29.29757,4.32188 l -8.95725,0.0431 -3.79645,2.40566 -3.79642,2.40607 7.89842,12.31736 c 4.34415,6.77483 7.99847,12.57591 8.12071,12.89163 0.12225,0.31567 8.40189,-0.58693 18.39927,-2.00578 l 18.177,-2.58 0.93754,2.70903 c 1.16603,3.36925 1.81259,3.29779 17.34476,-1.91581 z"
         id="path2788"
         inkscape:export-filename="/home/elijah/Desktop/crows-in-flight.png"
         inkscape:export-xdpi="72"
         inkscape:export-ydpi="72"
         sodipodi:nodetypes="cccccccccccccccccccccccccccccccssccccccccccscccscccssccccccccccscccccccsscccccccccccccscccc"
         inkscape:connector-curvature="0"
         style="fill:#00a800;fill-opacity:1" />
      <path
         d="m 386.24023,514.60706 -2.20175,-2.92228 -5.23607,-2.05819 -5.23612,-0.56905 -3.62485,-12.28684 -3.62486,-12.28679 -6.79158,-4.65368 -9.89598,-8.85541 -3.10432,-4.20197 0.34879,5.11271 0.34883,5.11272 -5.73089,-5.42482 -5.7308,-5.42486 1.68788,9.83845 1.68784,9.83869 6.41921,7.0909 6.96318,8.73646 -9.17791,-2.46006 -6.50708,-5.74649 -13.19221,-4.95565 0.52129,3.53382 -9.85381,-3.01641 -1.48266,0.40524 4.14965,7.41416 -6.52669,-1.54614 -4.80859,-0.32262 5.12256,6.94138 11.82239,10.16727 4.47934,1.34516 4.47934,1.34541 7.22748,1.94718 3.75349,5.1727 -4.99484,3.39681 -6.50167,-0.40386 -4.2541,4.14838 5.02183,3.33844 12.65563,-1.53479 14.39267,-0.54226 9.87803,-4.91138 9.87803,-4.91138 6.2238,-0.99098 8.89078,0.0246 -7.47526,-4.88458 z"
         id="path2786"
         inkscape:export-filename="/home/elijah/Desktop/crows-in-flight.png"
         inkscape:export-xdpi="72"
         inkscape:export-ydpi="72"
         sodipodi:nodetypes="ccccccccccccccccccccccccccccccccccccccccccc"
         inkscape:connector-curvature="0"
         style="fill:#00a800;fill-opacity:1" />
      <path
         d="m 146.92581,851.54899 -1.43565,-2.32288 2.97139,1.1403 2.97139,1.14006 -3.15629,-11.5303 -3.15628,-11.53053 -3.80432,-4.20373 -3.80427,-4.20356 2.39963,-6.26929 6.78623,-4.51428 -8.17336,-2.48507 -6.94515,2.4281 -1.50684,-5.55354 -1.50684,-5.55349 -7.0961,-7.85451 -7.0961,-7.85454 -0.0661,2.48765 -0.066,2.48765 -4.16937,-4.96379 -4.16938,-4.96379 1.59751,4.96379 c 0.87862,2.73008 1.49227,6.62829 1.36363,8.66285 l -0.23385,3.69922 3.75743,5.2356 3.75742,5.23583 1.28903,7.27596 1.28899,7.27596 -5.15294,3.37635 -5.15293,3.3764 v 2.79245 2.79241 l 4.90539,2.2351 4.90542,2.23511 3.7271,-4.60282 3.72709,-4.60285 9.73355,13.16403 c 5.35351,7.24018 10.45646,13.20071 11.33993,13.24561 l 1.60633,0.0816 -1.43569,-2.32305 z"
         id="path2790"
         inkscape:export-filename="/home/elijah/Desktop/crows-in-flight.png"
         inkscape:export-xdpi="72"
         inkscape:export-ydpi="72"
         sodipodi:nodetypes="ccccccccccccccccccccccccccccccccccccccc"
         inkscape:connector-curvature="0"
         style="fill:#00a800;fill-opacity:1" />
      <path
         d="m 182.75567,538.63109 c -15.33227,-8.79288 -17.19218,-11.29304 -6.53288,-8.78177 l 7.18619,1.69324 -11.28502,-9.83963 -11.28498,-9.83984 -8.05853,-14.27892 -8.0585,-14.27888 -10.74474,-4.60579 c -5.90959,-2.53315 -12.29033,-6.46805 -14.17942,-8.74424 l -3.43469,-4.13865 11.38698,-8.59571 16.81088,-8.27861 -18.20318,-2.91339 -6.2924,-2.66516 -22.114284,1.5912 c -2.839299,0.20431 -7.278021,-18.70918 -7.294378,-29.71016 l -0.01457,-9.7918 -8.820035,-9.80688 c -4.850996,-5.39389 -12.39435,-15.46484 -16.762957,-22.38002 l -7.942843,-12.57313 -0.99765,4.73371 -0.997689,4.73368 -4.522257,-7.83946 -4.522296,-7.83942 0.724376,12.16312 0.724375,12.16289 -2.321536,-1.43494 -2.321575,-1.43474 1.908032,10.177 c 1.049422,5.5974 3.460209,13.11678 5.357324,16.70995 3.726138,7.05716 10.662398,29.83805 13.446471,44.16239 l 1.726908,8.88483 -4.824275,3.52766 -4.824235,3.52747 H 41.799408 c -7.630065,0 -13.872878,0.63556 -13.872878,1.4125 0,1.46173 9.096444,14.97979 15.099294,22.43858 l 3.422333,4.2522 15.494098,-3.90294 15.494099,-3.90293 9.869337,1.8505 9.869337,1.8505 22.211752,22.62502 22.21176,22.62502 11.50056,6.2687 11.50052,6.2685 -1.85546,-3.00211 c -2.39741,-3.87912 -1.46138,-3.79153 9.80915,0.91752 l 9.38119,3.91981 7.27012,-0.0244 7.27008,-0.0246 -13.71903,-7.86784 z"
         id="path2792"
         inkscape:export-filename="/home/elijah/Desktop/crows-in-flight.png"
         inkscape:export-xdpi="72"
         inkscape:export-ydpi="72"
         sodipodi:nodetypes="ccccccccccccccsccccccccccccccscccccscccccccccccccccc"
         inkscape:connector-curvature="0"
         style="fill:#00a800;fill-opacity:1" />
      <path
         d="m 206.57018,472.26361 6.94933,-2.67608 13.15263,-0.15111 13.15267,-0.15107 8.32287,-2.93641 c 4.57761,-1.61522 10.86914,-4.74955 13.98119,-6.9656 l 5.65827,-4.02903 5.6273,-0.89347 c 3.09503,-0.49144 9.02999,-1.42779 13.18884,-2.08101 l 7.56158,-1.18755 -9.54707,-4.84389 c -5.25092,-2.66397 -11.05795,-4.84746 -12.90457,-4.85203 -4.55949,-0.0113 -5.27287,-1.60033 -6.79095,-15.12728 l -1.31142,-11.68562 -6.75446,-8.36758 c -3.71498,-4.60222 -8.94375,-12.19687 -11.61951,-16.87694 l -4.86501,-8.50933 -0.0239,3.47467 -0.0239,3.47466 h -1.84677 -1.84677 l -4.00636,-10.42399 -4.00632,-10.42402 -0.10347,8.43849 -0.10346,8.43845 h -1.82005 c -1.00103,0 -2.34774,-1.11683 -2.99272,-2.48189 l -1.17261,-2.4819 1.00432,8.27408 1.00435,8.27385 -2.33769,0.77932 -2.3377,0.77913 7.46769,12.09856 7.46764,12.09861 -0.6597,4.36178 -0.65974,4.36197 -5.61686,-4.43661 -5.61682,-4.43666 -8.28183,2.5216 -8.28178,2.52163 -15.88418,1.30964 -15.88418,1.30947 8.40276,2.69633 8.4028,2.69633 -3.43897,2.61156 -3.43897,2.61157 4.02562,0.0631 4.02565,0.0631 4.16112,2.91458 4.16113,2.91453 8.69016,1.32869 c 9.50816,1.45384 15.63953,4.00065 15.63953,6.49644 v 1.60133 l -7.67608,2.29982 c -4.22183,1.265 -10.97573,2.29985 -15.00861,2.29985 h -7.3325 l 1.2271,1.98554 1.22713,1.98549 h -4.08823 -4.08823 v 1.63944 c 0,1.73656 8.58563,10.37952 10.05559,10.1226 0.47563,-0.083 3.99198,-1.35533 7.81412,-2.82719 z"
         id="path2794"
         inkscape:export-filename="/home/elijah/Desktop/crows-in-flight.png"
         inkscape:export-xdpi="72"
         inkscape:export-ydpi="72"
         inkscape:connector-curvature="0"
         style="fill:#00a800;fill-opacity:1" />
      <path
         d="m 126.58079,655.82198 2.55174,-8.5169 2.77795,3.66647 2.77792,3.66666 0.0632,-6.39996 0.0631,-6.39972 4.3526,-8.95907 4.35265,-8.95887 -3.35988,-7.04584 -3.35984,-10.62989 v -3.58428 l 7.42305,-4.78667 7.44438,-2.5534 -9.90428,-4.02383 -6.94868,-0.0534 v -1.75002 l 3.33451,-7.39506 4.32708,-5.39667 8.81928,-4.82185 11.09337,-8.3068 2.27413,-2.74004 -10.2967,4.46206 -13.03725,3.96606 -8.24451,3.83862 -5.5039,2.84625 -9.48589,11.10345 -9.48589,11.10322 -5.66097,2.92748 -9.613414,2.92744 h -3.952483 l -1.16726,1.88862 -1.16722,1.88865 8.176136,2.44954 8.176141,2.44974 3.84425,-2.4009 3.84429,-2.40071 3.88821,9.07068 3.88816,9.07084 -0.67216,11.86844 -0.67217,11.86849 1.18985,-1.18993 1.18985,-1.18973 2.06446,8.47879 2.06446,8.47895 2.55173,-8.51687 z"
         id="path2796"
         inkscape:export-filename="/home/elijah/Desktop/crows-in-flight.png"
         inkscape:export-xdpi="72"
         inkscape:export-ydpi="72"
         sodipodi:nodetypes="ccccccccccccccccccccccccccccccccccccccccccccc"
         inkscape:connector-curvature="0"
         style="fill:#00a800;fill-opacity:1" />
      <path
         d="m 124.26267,878.21059 8.47403,-6.3541 -9.35825,-0.62425 -7.25261,2.1833 -2.73119,-5.63036 -2.73123,-5.63052 -5.29638,-3.33789 -7.804236,-2.6864 5.169846,8.1591 2.36239,6.05327 -6.331825,-4.69913 -15.913319,-2.98326 4.32958,4.60623 4.863422,3.69743 6.514538,6.67693 2.654484,5.09842 -2.142795,2.63558 -6.199974,4.76722 -3.355355,0.90344 -0.202444,2.0971 1.201245,1.74624 11.936183,-3.40752 11.93618,-3.40737 z"
         id="path2800"
         inkscape:export-filename="/home/elijah/Desktop/crows-in-flight.png"
         inkscape:export-xdpi="72"
         inkscape:export-ydpi="72"
         sodipodi:nodetypes="cccccccccccccccccccccccc"
         inkscape:connector-curvature="0"
         style="fill:#00a800;fill-opacity:1" />
      <path
         d="m 288.69339,735.85223 -5.30467,-8.09102 -2.34743,-4.45452 4.54211,3.02455 4.54211,3.02495 -7.51691,-11.86035 -7.51688,-11.86011 -2.26122,-8.69759 -1.61249,-19.20773 0.64878,-10.51077 -9.18252,-8.84191 -12.49928,-13.93259 -3.31676,-5.09088 5.35537,-3.48896 5.35538,-3.48939 7.78737,-0.78266 12.66004,0.72747 6.76431,0.27836 1.89167,-1.23241 -10.9911,-8.26372 -6.02274,-2.11302 -4.95732,-4.76762 -9.31798,-2.81964 -9.31803,-2.81965 -2.01852,-3.0984 -2.01849,-3.0982 1.38348,-15.50414 1.38352,-15.50454 -8.54342,-18.36989 -10.69694,-24.44693 -2.15348,-6.07686 -0.19776,4.61671 -0.19775,4.61695 -1.37574,-2.09571 -5.85587,-15.63302 -4.48021,-13.53711 -0.65371,7.90576 0.40679,9.63577 1.06042,9.1743 -3.18173,-7.3687 -3.18158,0.0761 -0.21828,6.5006 0.77424,13.44873 -3.60775,-6.8854 -2.61521,0.0623 0.0522,6.7933 4.66431,28.19737 4.6121,21.40373 -1.45732,14.81379 -1.45737,14.81379 -7.72531,3.25427 -19.93076,5.38035 -13.68472,3.09007 -1.47933,0.96378 2.70165,4.91912 3.2804,11.62761 0.57867,6.70869 5.93519,0.32048 5.93516,0.32044 -1.9558,1.32 -1.95583,1.31995 4.47719,-0.0167 4.47724,-0.0165 5.89259,-3.79336 5.89264,-3.79331 8.0527,1.6992 8.0527,1.69923 12.9862,16.7578 12.98623,16.75759 5.64851,15.63937 5.64846,15.63957 1.78301,0.37646 1.78293,0.37623 -0.059,-4.36297 -0.059,-4.36297 5.80525,8.84012 5.80521,8.83973 2.14784,-2.96476 2.14791,-2.9648 6.81259,7.52116 6.81263,7.52136 3.1782,-0.076 3.17812,-0.0759 -2.95718,-3.63645 z"
         id="path2802"
         inkscape:export-filename="/home/elijah/Desktop/crows-in-flight.png"
         inkscape:export-xdpi="72"
         inkscape:export-ydpi="72"
         sodipodi:nodetypes="cccccccccccccccccccccccccccccccccccccccccccccccccccccccccccccccccccccccccccccccccccc"
         inkscape:connector-curvature="0"
         style="fill:#00a800;fill-opacity:1" />
      <path
         d="m 203.57453,806.45856 -3.40919,-6.73866 -4.34522,-6.70889 6.70892,3.29259 -1.98319,-4.58614 c -1.3803,-0.88176 -5.87433,-5.79159 -9.98677,-10.91066 l -7.47721,-9.3075 -3.93954,-1.25032 -3.93958,-1.25048 v -2.7934 -2.79344 l 6.45296,-3.43556 6.45295,-3.43555 -8.93485,-1.7713 c -4.91416,-0.97426 -8.3835,0.38699 -9.63974,0.0227 l -3.86319,-3.11888 -1.43863,-8.57686 -1.43866,-8.57665 -5.30671,-6.06439 c -2.9187,-3.33547 -6.46451,-8.85958 -7.87963,-12.27588 l -5.20491,-9.72093 1.20169,11.54781 -3.88674,-5.99828 -3.25888,-6.30205 c -4.15195,-8.02884 -5.21153,-6.95409 -2.96484,3.00748 l 1.76733,7.83628 1.31539,6.97076 -6.40504,-7.94368 3.31776,10.32096 c 1.43874,3.64999 4.28412,10.43371 6.32305,15.07488 2.03893,4.64112 4.22937,11.04962 4.86763,14.24076 l 1.16043,5.80227 -8.84659,1.32675 -8.84656,1.3265 0.95977,9.67706 c 1.97545,3.87475 2.86896,5.40298 3.2723,6.61296 l 4.41808,2.19997 7.14998,-5.45345 c 3.93247,-2.99953 7.70415,-5.45364 8.38151,-5.45364 0.67733,0 8.45446,7.15522 17.28247,15.90066 l 19.38473,19.05904 -0.4544,-5.25688 -3.61275,-6.83573 1.28669,2.08181 c 0.7077,1.14503 3.75937,3.48558 4.85139,3.48558 l 6.37208,4.56212 4.13571,2.21029 z"
         id="path2804"
         inkscape:export-filename="/home/elijah/Desktop/crows-in-flight.png"
         inkscape:export-xdpi="72"
         inkscape:export-ydpi="72"
         sodipodi:nodetypes="cccccccccccccccccccccccccccccsccccccccscccccccc"
         inkscape:connector-curvature="0"
         style="fill:#00a800;fill-opacity:1" />
      <path
         d="m 333.64535,397.40091 19.93464,-3.88351 18.59512,1.59954 27.17745,3.27015 8.58238,1.67065 -10.90562,-10.17282 -16.76177,-11.10148 -7.96178,-8.64911 -8.98523,-4.95668 -10.77758,-2.51326 -3.89789,-2.46959 5.10997,-34.62135 5.1099,-34.62136 -11.93999,-23.76769 -11.94007,-23.7677 -0.2011,-5.61088 -0.20105,-5.61089 -2.3668,5.72148 -2.36672,5.72168 -4.58415,-10.63605 -4.62791,-15.73446 -0.0438,-5.09823 -2.77315,4.29131 -2.77316,4.29111 -0.13479,11.44316 -0.13479,11.44316 -3.9867,-5.26124 -3.98667,-5.26123 -1.972,13.14991 -1.97191,13.14972 1.4906,5.70023 1.49064,5.70004 h -2.35457 l -3.79753,-3.57592 -1.44291,-3.57613 -0.22587,9.38953 -0.22583,9.38934 4.29115,10.27031 4.29119,10.27031 -0.016,7.51779 -3.30835,18.96094 -3.29243,11.44315 -6.30784,-26.6207 -6.30785,-26.62067 -9.10653,-11.9999 -17.73706,-29.16474 -8.63061,-17.16464 0.89104,14.88089 0.89105,14.8809 -2.29184,-2.29666 -9.37785,-19.1722 -7.08598,-16.87535 0.79544,19.31635 -0.40961,19.3102 -6.18009,-4.50833 -4.97498,-4.50217 2.67997,11.92763 6.67676,21.49327 3.9968,9.56585 -4.40542,-1.69067 -4.40549,-1.69047 2.93574,5.44013 14.63676,25.42026 11.70098,19.98011 v 9.1741 9.1741 l -2.59287,1.60252 -2.59286,1.60252 -25.29983,-8.33304 -30.57259,-10.42442 -5.27284,-2.09114 6.04617,11.85137 6.04616,11.85142 h 4.53914 4.53909 l -1.52566,3.97579 -1.52562,3.97583 8.72916,1.74584 16.31936,1.74569 h 7.59028 l 21.37518,10.30543 21.37518,10.30567 14.39481,2.00439 14.39477,2.00459 19.93465,-3.88368 z"
         id="path2806"
         inkscape:export-filename="/home/elijah/Desktop/crows-in-flight.png"
         inkscape:export-xdpi="72"
         inkscape:export-ydpi="72"
         sodipodi:nodetypes="ccccccccccccccccccccccccccccccccccccccccccccccccccccccccccccccccccccccccccccccccccccc"
         inkscape:connector-curvature="0"
         style="fill:#00a800;fill-opacity:1" />
      <g
         id="g2808"
         transform="matrix(1.5685481,0,0,1.5685481,-453.82358,175.82695)"
         inkscape:export-filename="/home/elijah/Desktop/crows-in-flight.png"
         inkscape:export-xdpi="72.000000"
         inkscape:export-ydpi="72.000000" />
    </g>
  </g>
  <g
     inkscape:groupmode="layer"
     id="layer2"
     inkscape:label="top"
     style=""
     transform="translate(0,-196)" />
  <g
     inkscape:groupmode="layer"
     id="layer3"
     inkscape:label="black"
     style=""
     transform="translate(0,-196)" />
</svg>
