<?xml version="1.0" encoding="UTF-8" standalone="no"?>
<!-- Created with Inkscape (http://www.inkscape.org/) -->

<svg
   xmlns:dc="http://purl.org/dc/elements/1.1/"
   xmlns:cc="http://creativecommons.org/ns#"
   xmlns:rdf="http://www.w3.org/1999/02/22-rdf-syntax-ns#"
   xmlns:svg="http://www.w3.org/2000/svg"
   xmlns="http://www.w3.org/2000/svg"
   xmlns:sodipodi="http://sodipodi.sourceforge.net/DTD/sodipodi-0.dtd"
   xmlns:inkscape="http://www.inkscape.org/namespaces/inkscape"
   viewBox="0 0 600 300"
   id="svg4706"
   version="1.1"
   inkscape:version="0.48.2 r9819"
   sodipodi:docname="New document 8">
  <defs
     id="defs4708" />
  <sodipodi:namedview
     id="base"
     pagecolor="#ffffff"
     bordercolor="#666666"
     borderopacity="1.0"
     inkscape:pageopacity="0.0"
     inkscape:pageshadow="2"
     inkscape:zoom="0.7"
     inkscape:cx="320.64007"
     inkscape:cy="302.60482"
     inkscape:document-units="px"
     inkscape:current-layer="layer1"
     showgrid="false"
     width="120px"
     inkscape:window-width="1920"
     inkscape:window-height="1017"
     inkscape:window-x="-8"
     inkscape:window-y="-8"
     inkscape:window-maximized="1" />
  <metadata
     id="metadata4711">
    <rdf:RDF>
      <cc:Work
         rdf:about="">
        <dc:format>image/svg+xml</dc:format>
        <dc:type
           rdf:resource="http://purl.org/dc/dcmitype/StillImage" />
        <dc:title></dc:title>
      </cc:Work>
    </rdf:RDF>
  </metadata>
  <g
     inkscape:label="Layer 1"
     inkscape:groupmode="layer"
     id="layer1"
     transform="translate(0,-752.36221)">
    <g
       transform="matrix(7.9627942,0,0,7.9627942,2631.561,-4518.9881)"
       style="font-style:normal;font-variant:normal;font-weight:normal;font-stretch:normal;line-height:0.01%;letter-spacing:0px;word-spacing:0px;fill:currentColor;fill-opacity:1;stroke:none;font-family:Bebas Kai;-inkscape-font-specification:Bebas Kai"
       id="flowRoot3783">
      <path
         d="m -323.80129,667.79534 -3.47996,0 0,26.07966 13.71982,0 0,-3.47996 -10.23986,0 z"
         style="font-size:40px;font-weight:bold;line-height:1.25;font-family:Xelo;-inkscape-font-specification:Xelo Bold"
         id="path4728"
         inkscape:connector-curvature="0" />
      <path
         d="m -295.43268,688.23507 c -0.0167,0.615 -0.23334,1.12499 -0.64999,1.52998 -0.41667,0.405 -0.93333,0.615 -1.54998,0.62999 l -6.03992,0 c -0.615,-0.015 -1.12499,-0.22499 -1.52998,-0.62999 -0.405,-0.40499 -0.615,-0.91498 -0.62999,-1.52998 l 0,-20.43973 -3.47996,0 0,20.43973 c 0.04,1.59999 0.58999,2.92997 1.64998,3.98995 1.05998,1.05999 2.38996,1.60998 3.98995,1.64998 l 6.03992,0 c 1.59997,-0.04 2.92995,-0.58999 3.98995,-1.64998 1.05997,-1.05998 1.60996,-2.38996 1.64998,-3.98995 l 0,-20.43973 -3.43996,0 z"
         style="font-size:40px;font-weight:bold;line-height:1.25;font-family:Xelo;-inkscape-font-specification:Xelo Bold"
         id="path4730"
         inkscape:connector-curvature="0" />
      <path
         d="m -269.55023,667.79534 c -0.0337,0.0607 -0.38887,0.70428 -1.06562,1.9306 -0.67677,1.22636 -1.47322,2.67113 -2.38934,4.33432 -0.91615,1.66322 -1.7501,3.18049 -2.50184,4.55181 -0.75178,1.37135 -1.21948,2.23238 -1.40311,2.58309 l -7.3599,-13.39982 -3.47996,0 0,26.07966 3.47996,0 0,-18.87976 7.3599,13.35983 7.35991,-13.35983 0,18.87976 3.47995,0 0,-26.07966 -3.47995,0 z"
         style="font-size:40px;font-weight:bold;line-height:1.25;font-family:Xelo;-inkscape-font-specification:Xelo Bold"
         id="path4732"
         inkscape:connector-curvature="0" />
      <path
         d="m -261.8125,693.875 3.47996,0 0,-26.07966 -3.47996,0 z"
         style="font-size:40px;font-weight:bold;line-height:1.25;font-family:Xelo;-inkscape-font-specification:Xelo Bold"
         id="path4734"
         inkscape:connector-curvature="0" />
    </g>
  </g>
</svg>
