<?xml version="1.0" encoding="UTF-8" standalone="no"?>
<!-- Created with Inkscape (http://www.inkscape.org/) -->

<svg
   xmlns:dc="http://purl.org/dc/elements/1.1/"
   xmlns:cc="http://creativecommons.org/ns#"
   xmlns:rdf="http://www.w3.org/1999/02/22-rdf-syntax-ns#"
   xmlns:svg="http://www.w3.org/2000/svg"
   xmlns="http://www.w3.org/2000/svg"
   xmlns:sodipodi="http://sodipodi.sourceforge.net/DTD/sodipodi-0.dtd"
   xmlns:inkscape="http://www.inkscape.org/namespaces/inkscape"
   width="1000"
   height="1000"
   id="svg4133"
   version="1.1"
   inkscape:version="0.48.2 r9819"
   sodipodi:docname="New document 4">
  <defs
     id="defs3" />
  <sodipodi:namedview
     inkscape:document-units="mm"
     id="base"
     pagecolor="#ffffff"
     bordercolor="#666666"
     borderopacity="1.0"
     inkscape:pageopacity="0.0"
     inkscape:pageshadow="2"
     inkscape:zoom="0.175"
     inkscape:cx="-739.24232"
     inkscape:cy="1238.6973"
     inkscape:current-layer="layer1"
     showgrid="false"
     units="px"
     inkscape:window-width="1920"
     inkscape:window-height="1017"
     inkscape:window-x="-8"
     inkscape:window-y="-8"
     inkscape:window-maximized="1" />
  <metadata
     id="metadata4">
    <rdf:RDF>
      <cc:Work
         rdf:about="">
        <dc:format>image/svg+xml</dc:format>
        <dc:type
           rdf:resource="http://purl.org/dc/dcmitype/StillImage" />
        <dc:title></dc:title>
      </cc:Work>
    </rdf:RDF>
  </metadata>
  <g
     inkscape:label="Layer 1"
     inkscape:groupmode="layer"
     id="layer1"
     transform="translate(0,-52.36218)">
    <g
       id="g3766"
       transform="matrix(31.660445,0,0,31.660445,-2675.8283,-3685.1849)"
       inkscape:export-filename="E:\2019\frelo\047- Miniloom\MOCKUP-V0.png"
       inkscape:export-xdpi="600"
       inkscape:export-ydpi="600">
      <g
         transform="matrix(0.17124874,0,0,0.17124874,31.353995,154.62785)"
         id="g2990">
        <path
           style="fill:#ff00ff;fill-opacity:1;stroke:none"
           id="path872"
           sodipodi:type="arc"
           sodipodi:cx="402.246"
           sodipodi:cy="-52.933678"
           sodipodi:rx="15.768902"
           sodipodi:ry="15.768902"
           sodipodi:start="5.1692464"
           sodipodi:end="11.431837"
           sodipodi:open="true"
           d="m 409.20214,-67.085372 c 7.81576,3.841768 11.03732,13.292065 7.19556,21.10783 -3.84177,7.815765 -13.29207,11.037326 -21.10783,7.195558 -7.81577,-3.841767 -11.03733,-13.292065 -7.19556,-21.107829 3.78594,-7.702188 13.0364,-10.962331 20.81492,-7.335807" />
        <path
           style="fill:#ff00ff;fill-opacity:1;stroke:none"
           id="path872-3"
           sodipodi:type="arc"
           sodipodi:cx="468.80692"
           sodipodi:cy="-165.41388"
           sodipodi:rx="15.768902"
           sodipodi:ry="15.768902"
           sodipodi:start="5.1692464"
           sodipodi:end="11.431837"
           sodipodi:open="true"
           d="m 475.76305,-179.56557 c 7.81577,3.84176 11.03733,13.29206 7.19556,21.10783 -3.84177,7.81576 -13.29207,11.03732 -21.10783,7.19555 -7.81577,-3.84176 -11.03733,-13.29206 -7.19556,-21.10783 3.78594,-7.70218 13.03641,-10.96233 20.81493,-7.3358" />
        <path
           d="m 343.46935,-180.09473 c 7.81576,3.84176 11.03733,13.29206 7.19556,21.10783 -3.84177,7.81576 -13.29207,11.03732 -21.10783,7.19555 -7.81577,-3.84176 -11.03733,-13.29206 -7.19556,-21.10782 3.78594,-7.70219 13.03641,-10.96234 20.81493,-7.33581"
           sodipodi:open="true"
           sodipodi:end="11.431837"
           sodipodi:start="5.1692464"
           sodipodi:ry="15.768902"
           sodipodi:rx="15.768902"
           sodipodi:cy="-165.94304"
           sodipodi:cx="336.51321"
           sodipodi:type="arc"
           id="path889"
           style="fill:#ff00ff;fill-opacity:1;stroke:none" />
        <path
           style="fill:#000000;stroke-width:0.26458335"
           d="m 400.04998,-52.774382 c -0.50932,-0.33329 -2.4388,-1.477163 -4.28771,-2.541942 -1.84892,-1.064776 -3.30126,-2.03372 -3.22741,-2.153208 0.0738,-0.119486 -0.0495,-0.146728 -0.27412,-0.06053 -0.24057,0.09232 -0.47529,-0.01765 -0.57121,-0.267616 -0.0896,-0.233378 -0.37972,-0.424325 -0.64479,-0.424325 -0.26508,0 -0.6393,-0.148828 -0.83159,-0.330729 -0.1923,-0.181901 -1.00447,-0.657728 -1.80484,-1.057392 -0.80036,-0.399666 -1.81239,-0.936823 -2.24896,-1.193686 -0.43656,-0.256863 -1.47836,-0.861335 -2.3151,-1.343276 -0.83675,-0.481939 -1.52136,-0.993603 -1.52136,-1.137034 0,-0.143428 -0.0961,-0.201404 -0.21349,-0.128831 -0.11743,0.07257 -0.74251,-0.172916 -1.38907,-0.545529 -0.64656,-0.372615 -1.53275,-0.882943 -1.96931,-1.134067 -1.12721,-0.648404 -5.40095,-3.133281 -8.20208,-4.768932 -1.30969,-0.764757 -2.97657,-1.71926 -3.70417,-2.121117 -2.52262,-1.393243 -4.88452,-2.830455 -4.82366,-2.93519 0.0336,-0.05789 0.0162,-0.08015 -0.0387,-0.04946 -0.10271,0.05737 -0.4115,-0.11217 -4.92718,-2.705288 -1.45521,-0.835652 -3.12209,-1.781969 -3.70417,-2.102929 -0.58208,-0.320961 -1.47505,-0.840463 -1.98438,-1.154446 -0.50932,-0.313987 -1.10463,-0.651658 -1.32291,-0.750385 -0.21828,-0.09873 -1.02427,-0.576001 -1.79108,-1.060609 -0.76681,-0.484608 -1.46832,-0.881105 -1.5589,-0.881105 -0.0906,0 -0.89619,-0.446484 -1.79022,-0.992187 -0.89403,-0.545703 -1.8594,-1.134848 -2.14526,-1.309209 -0.28586,-0.17436 -0.996,-0.570719 -1.57808,-0.880798 -0.58209,-0.310075 -2.093,-1.179449 -3.3576,-1.931937 l -2.29926,-1.36816 -0.0197,-9.440852 c -0.014,-6.733969 0.0657,-9.493669 0.27832,-9.625049 0.16391,-0.1013 0.40195,-0.0201 0.52898,0.18044 0.1795,0.2834 0.23185,0.25461 0.235,-0.12925 0.003,-0.36434 -0.13475,-0.45759 -0.52512,-0.3555 -0.52674,0.13774 -0.52916,0.008 -0.52916,-28.27956 0,-15.62987 0.0559,-28.41794 0.12425,-28.41794 0.0683,0 0.52163,0.2232 1.00732,0.496 3.75444,2.10874 5.45041,3.09042 6.06762,3.51211 0.39429,0.2694 0.78361,0.48981 0.86515,0.48981 0.0815,0 0.59238,0.27889 1.13519,0.61976 0.54281,0.34086 1.64178,0.98403 2.44214,1.42925 4.35422,2.42215 11.26245,6.49676 11.4045,6.7266 0.0902,0.14598 0.21026,0.23764 0.26675,0.2037 0.10501,-0.0631 1.59131,0.70983 3.01313,1.56694 0.82182,0.49541 2.7096,1.57342 4.42958,2.52949 0.54451,0.30266 0.99099,0.70616 0.99219,0.89664 10e-4,0.19049 0.12268,0.27187 0.26996,0.18085 0.22769,-0.14071 1.46164,0.47407 3.83327,1.90983 0.29104,0.17619 0.70776,0.40832 0.92604,0.51583 0.21828,0.10751 1.56743,0.88609 2.99812,1.73017 1.43069,0.84408 2.67002,1.53469 2.75408,1.53469 0.34778,0 2.97767,2.1893 4.80946,4.00372 4.8948,4.84838 9.07053,10.49629 12.20021,16.50149 1.91297,3.67059 3.50352,7.50146 3.31669,7.98833 -0.0788,0.20544 -0.033,0.30534 0.10182,0.22201 0.26627,-0.16456 2.39462,6.26932 2.39462,7.23881 0,0.32611 0.11979,0.81675 0.2662,1.09032 0.17283,0.32294 0.26933,9.062814 0.27514,24.919585 0.011,29.927463 0.0276,27.732675 -0.21061,27.71358 -0.10914,-0.0088 -0.61516,-0.288596 -1.12448,-0.621887 z m -1.22724,-2.404917 c -0.0838,-0.218281 -0.19909,-0.396875 -0.25628,-0.396875 -0.0572,0 -0.10398,0.178594 -0.10398,0.396875 0,0.218281 0.11532,0.396875 0.25628,0.396875 0.14095,0 0.18774,-0.178594 0.10398,-0.396875 z m 1.7564,-1.819688 c 0,-0.05494 -0.20835,-0.2633 -0.46302,-0.46302 -0.41964,-0.329108 -0.429,-0.319749 -0.0999,0.0999 0.34564,0.440729 0.56291,0.580887 0.56291,0.363124 z m -22.225,-20.372917 c 0,-0.05494 -0.20835,-0.2633 -0.46302,-0.46302 -0.41964,-0.329108 -0.429,-0.319749 -0.0999,0.0999 0.34564,0.440729 0.56291,0.580887 0.56291,0.363124 z m 20.37292,-0.693854 c 0,-0.14552 -0.12609,-0.264583 -0.2802,-0.264583 -0.15411,0 -0.20661,0.119063 -0.11667,0.264583 0.0899,0.145521 0.21602,0.264584 0.2802,0.264584 0.0642,0 0.11667,-0.119063 0.11667,-0.264584 z m -33.07292,-1.5875 c 0,-0.14552 -0.0525,-0.264583 -0.11667,-0.264583 -0.0642,0 -0.19026,0.119063 -0.2802,0.264583 -0.0899,0.145521 -0.0374,0.264584 0.11668,0.264584 0.1541,0 0.28019,-0.119063 0.28019,-0.264584 z m 10.84792,-4.365625 c 0,-0.218281 -0.0468,-0.396875 -0.10398,-0.396875 -0.0572,0 -0.17252,0.178594 -0.25628,0.396875 -0.0838,0.218282 -0.037,0.396875 0.10398,0.396875 0.14095,0 0.25628,-0.178593 0.25628,-0.396875 z m -9.06749,-2.937978 c -0.0879,-0.08792 -0.31612,-0.09732 -0.50712,-0.02088 -0.21106,0.08446 -0.14837,0.147156 0.15986,0.159851 0.27891,0.01148 0.43518,-0.05105 0.34726,-0.138964 z m 32.48124,-7.245451 c 0.0927,-0.149981 -0.0135,-0.194336 -0.24896,-0.103984 -0.45837,0.175893 -0.54224,0.365538 -0.16165,0.365538 0.13693,0 0.32171,-0.1177 0.41061,-0.261554 z m -15.21167,-1.325946 c 0,-0.145521 -0.0525,-0.264583 -0.11667,-0.264583 -0.0642,0 -0.19026,0.119062 -0.2802,0.264583 -0.0899,0.145521 -0.0374,0.264584 0.11668,0.264584 0.1541,0 0.28019,-0.119063 0.28019,-0.264584 z m -36.77708,-2.793741 c 0,-0.226869 -0.11906,-0.338904 -0.26458,-0.248967 -0.14552,0.08994 -0.26459,0.03743 -0.26459,-0.116676 0,-0.154109 -0.11906,-0.280199 -0.26458,-0.280199 -0.45705,0 -0.28737,0.748996 0.19844,0.875948 0.25466,0.06655 0.49278,0.134813 0.52916,0.151693 0.0364,0.01688 0.0661,-0.154929 0.0661,-0.381799 z m 17.92001,-2.657781 c -0.0879,-0.0879 -0.31612,-0.0973 -0.50712,-0.0209 -0.21106,0.0845 -0.14837,0.14715 0.15986,0.15985 0.27891,0.0115 0.43518,-0.0511 0.34726,-0.13897 z m -10.90855,-1.16306 c 0.0899,-0.14552 0.0374,-0.26458 -0.11668,-0.26458 -0.15411,0 -0.2802,0.11906 -0.2802,0.26458 0,0.14552 0.0525,0.26458 0.11668,0.26458 0.0642,0 0.19026,-0.11906 0.2802,-0.26458 z m -15.61042,-3.43958 c 0.0899,-0.14553 0.0374,-0.26459 -0.11667,-0.26459 -0.15411,0 -0.2802,0.11906 -0.2802,0.26459 0,0.14552 0.0525,0.26458 0.11667,0.26458 0.0642,0 0.19027,-0.11906 0.2802,-0.26458 z m 32.94063,-2.91042 c 0,-0.14552 -0.12609,-0.26458 -0.2802,-0.26458 -0.15411,0 -0.20661,0.11906 -0.11668,0.26458 0.0899,0.14552 0.21603,0.26458 0.2802,0.26458 0.0642,0 0.11668,-0.11906 0.11668,-0.26458 z m -1.93593,-18.04128 c -0.0845,-0.21106 -0.14716,-0.14837 -0.15985,0.15986 -0.0115,0.27891 0.051,0.43518 0.13896,0.34726 0.0879,-0.0879 0.0973,-0.31612 0.0209,-0.50712 z m -32.85678,-16.88372 c 0.0899,-0.14552 0.0445,-0.26459 -0.10106,-0.26459 -0.14552,0 -0.33817,0.11907 -0.42811,0.26459 -0.0899,0.14552 -0.0445,0.26458 0.10107,0.26458 0.14552,0 0.33816,-0.11906 0.4281,-0.26458 z m -1.27998,-15.1474 c -0.0734,-0.1819 -0.13345,-0.0331 -0.13345,0.33073 0,0.3638 0.06,0.51263 0.13345,0.33073 0.0734,-0.1819 0.0734,-0.47956 0,-0.66146 z m 66.75643,105.965629 c -0.006,-0.348591 0.0339,-25.404369 0.0439,-27.582813 10e-4,-0.218281 -0.009,-5.648487 -0.022,-12.067122 -0.0258,-12.680234 -0.026,-12.678264 1.56901,-17.698504 1.01671,-3.20001 1.80689,-5.36458 2.36638,-6.48229 0.25495,-0.50932 1.15105,-2.35479 1.99133,-4.10104 1.56266,-3.24751 4.42541,-7.81166 6.94523,-11.07297 2.19193,-2.83694 2.65581,-3.34242 3.44521,-3.75419 0.40397,-0.21072 0.55888,-0.38386 0.34424,-0.38476 -0.56861,-0.002 3.31374,-3.8502 5.02046,-4.97582 0.80036,-0.52786 1.69333,-1.09416 1.98437,-1.25846 0.29105,-0.16429 1.7198,-0.99055 3.175,-1.83613 1.45521,-0.84558 3.00302,-1.74199 3.43959,-1.99202 0.43656,-0.25003 1.86531,-1.08384 3.175,-1.85291 1.30968,-0.76907 2.8575,-1.66102 3.43958,-1.98213 0.58208,-0.3211 2.80574,-1.60107 4.94145,-2.84437 2.13572,-1.24331 3.95142,-2.19226 4.0349,-2.10878 0.0835,0.0835 0.15178,0.0264 0.15178,-0.12676 0,-0.15319 0.38695,-0.47571 0.85989,-0.7167 0.47294,-0.24099 1.21708,-0.65436 1.65365,-0.9186 0.72692,-0.43997 4.97961,-2.91391 6.87916,-4.00183 0.43657,-0.25003 1.86532,-1.07749 3.175,-1.83878 1.30969,-0.7613 2.8575,-1.6528 3.43959,-1.98112 0.58208,-0.32832 1.68341,-0.96779 2.44739,-1.42105 l 1.38907,-0.8241 v 38.08938 38.08938 l -0.99219,0.629187 c -3.19622,2.026849 -5.29782,3.154924 -5.81982,3.123904 -0.32686,-0.01942 -0.56499,0.09038 -0.52917,0.244009 0.0358,0.153631 -1.06596,0.941978 -2.44841,1.751881 -3.06196,1.793848 -7.25655,4.232378 -8.33437,4.845203 -0.43657,0.248222 -1.98438,1.14119 -3.43959,1.984375 -1.4552,0.843188 -3.06255,1.764681 -3.57187,2.047764 -0.50932,0.283083 -1.30456,0.745562 -1.7672,1.027729 -0.80327,0.489926 -0.85355,0.491728 -1.11643,0.04002 -0.24991,-0.429416 -0.27602,-0.418452 -0.28333,0.118977 -0.008,0.61285 -0.58502,1.055656 -3.44762,2.647212 -0.80037,0.444987 -2.94349,1.670566 -4.7625,2.723507 -1.81901,1.052942 -4.79558,2.770799 -6.61459,3.817464 -1.81901,1.046666 -4.49791,2.59656 -5.95312,3.444214 -1.45521,0.847651 -3.00302,1.744274 -3.43959,1.992492 -0.43656,0.248222 -1.98437,1.141191 -3.43958,1.984375 -3.21776,1.864456 -3.69993,2.141435 -6.21771,3.571659 -1.0914,0.619974 -2.30041,1.349147 -2.68668,1.620385 -0.86962,0.61065 -1.0154,0.614934 -1.02541,0.03014 z m 22.00117,-17.33462 c -0.2613,-0.25936 -0.29169,-0.22897 -0.14811,0.148114 0.0994,0.260938 0.2473,0.407781 0.32877,0.326319 0.0815,-0.08146 1.7e-4,-0.294955 -0.18066,-0.474433 z m -10.08699,-2.04611 c 0,-0.145521 -0.20836,-0.26276 -0.46303,-0.260532 -0.39569,0.0035 -0.40531,0.04134 -0.0661,0.260532 0.49932,0.322689 0.52917,0.322689 0.52917,0 z m 27.65595,-7.092651 c -0.0815,-0.08146 -0.29495,-1.69e-4 -0.47443,0.180652 -0.25936,0.261308 -0.22897,0.291698 0.14812,0.148114 0.26093,-0.09936 0.40778,-0.247303 0.32631,-0.328766 z m -24.61325,-1.638599 c 0.0899,-0.145521 0.0374,-0.264583 -0.11667,-0.264583 -0.15411,0 -0.2802,0.119062 -0.2802,0.264583 0,0.145521 0.0525,0.264583 0.11667,0.264583 0.0642,0 0.19027,-0.119062 0.2802,-0.264583 z m 42.1172,-6.399609 c -0.0845,-0.211066 -0.14715,-0.148373 -0.15985,0.159853 -0.0115,0.278913 0.0511,0.435184 0.13897,0.347266 0.0879,-0.08792 0.0973,-0.316125 0.0209,-0.507119 z m -51.32917,-4.233334 c -0.0845,-0.211066 -0.14715,-0.148373 -0.15985,0.159854 -0.0115,0.278913 0.051,0.435184 0.13897,0.347265 0.0879,-0.08792 0.0973,-0.316124 0.0209,-0.507119 z m -4.41407,-2.964791 c 0,-0.05719 -0.18478,-0.17489 -0.41062,-0.261554 -0.23545,-0.09035 -0.34166,-0.046 -0.24896,0.103984 0.15538,0.25141 0.65958,0.371859 0.65958,0.15757 z m 62.44167,-0.954349 c 0,-0.145521 -0.12609,-0.264584 -0.2802,-0.264584 -0.15411,0 -0.20661,0.119063 -0.11668,0.264584 0.0899,0.14552 0.21603,0.264583 0.2802,0.264583 0.0642,0 0.11668,-0.119063 0.11668,-0.264583 z M 460.1104,-97.7616 c 0,-0.06417 -0.11907,-0.190262 -0.26459,-0.2802 -0.14552,-0.08994 -0.26458,-0.03743 -0.26458,0.116676 0,0.15411 0.11906,0.280199 0.26458,0.280199 0.14552,0 0.26459,-0.0525 0.26459,-0.116675 z m -15.08125,-6.23332 c -0.21829,-0.14107 -0.51594,-0.25648 -0.66146,-0.25648 -0.14552,0 -0.086,0.11541 0.13229,0.25648 0.21828,0.14106 0.51594,0.25647 0.66146,0.25647 0.14552,0 0.086,-0.11541 -0.13229,-0.25647 z m -10.71563,-1.05834 c 0.0899,-0.14552 0.0374,-0.26458 -0.11668,-0.26458 -0.1541,0 -0.28019,0.11906 -0.28019,0.26458 0,0.14552 0.0525,0.26459 0.11667,0.26459 0.0642,0 0.19026,-0.11907 0.2802,-0.26459 z m 22.75417,-4.23333 c -0.0899,-0.14552 -0.30533,-0.26276 -0.47864,-0.26053 -0.18934,0.002 -0.1567,0.10642 0.0818,0.26053 0.5083,0.32849 0.59989,0.32849 0.39688,0 z m -8.6828,-3.48919 c -0.0845,-0.21107 -0.14716,-0.14838 -0.15986,0.15985 -0.0115,0.27891 0.051,0.43518 0.13897,0.34726 0.0879,-0.0879 0.0973,-0.31612 0.0209,-0.50711 z m -40.92658,-0.86082 c 0,-0.0642 -0.11906,-0.19026 -0.26458,-0.2802 -0.14552,-0.0899 -0.26458,-0.0374 -0.26458,0.11668 0,0.15411 0.11906,0.2802 0.26458,0.2802 0.14552,0 0.26458,-0.0525 0.26458,-0.11668 z m 4.32464,-2.40828 c -0.0862,-0.22456 -0.21342,-0.35154 -0.28278,-0.28218 -0.0694,0.0694 -0.0476,0.25308 0.0483,0.40828 0.2609,0.42213 0.41338,0.34013 0.23448,-0.1261 z m 14.98995,0.027 c 0,-0.0642 -0.11907,-0.19026 -0.26459,-0.2802 -0.14552,-0.0899 -0.26458,-0.0374 -0.26458,0.11668 0,0.15411 0.11906,0.2802 0.26458,0.2802 0.14552,0 0.26459,-0.0525 0.26459,-0.11668 z m -5.91019,-2.33072 c -0.0734,-0.1819 -0.13346,-0.0331 -0.13346,0.33073 0,0.3638 0.0601,0.51263 0.13346,0.33073 0.0734,-0.1819 0.0734,-0.47956 0,-0.66146 z m 28.92894,-6.01927 c 0,-0.14552 -0.12609,-0.26458 -0.2802,-0.26458 -0.15411,0 -0.20662,0.11906 -0.11668,0.26458 0.0899,0.14552 0.21603,0.26458 0.2802,0.26458 0.0642,0 0.11668,-0.11906 0.11668,-0.26458 z m -50.9323,-14.06012 c -4.41335,-0.20195 -7.02905,-0.55384 -11.64166,-1.56618 -4.66139,-1.02305 -6.0911,-1.55586 -9.65135,-3.59674 -1.67676,-0.9612 -3.58444,-2.04877 -4.23928,-2.41684 -0.65484,-0.36807 -1.66687,-0.9694 -2.24896,-1.33629 -0.58208,-0.36689 -1.29677,-0.79445 -1.58819,-0.95014 -3.62769,-1.93802 -9.60139,-5.58231 -9.47794,-5.78206 0.0878,-0.14201 -0.002,-0.20434 -0.19946,-0.13852 -0.19746,0.0658 -1.07724,-0.29075 -1.95505,-0.79238 -0.87782,-0.50163 -2.07227,-1.17625 -2.65436,-1.49914 -0.58208,-0.32289 -2.12989,-1.21631 -3.43958,-1.98538 -1.30969,-0.76907 -2.79797,-1.63531 -3.30729,-1.92497 -0.50933,-0.28967 -1.99761,-1.15547 -3.30729,-1.924 -2.70461,-1.58707 -4.50872,-2.6165 -7.07312,-4.03596 -0.97979,-0.54234 -1.78346,-1.06358 -1.78594,-1.1583 -0.002,-0.0947 0.53085,-0.39238 1.18515,-0.66146 0.6543,-0.26908 1.19008,-0.57853 1.19062,-0.68767 5.3e-4,-0.10914 0.11409,-0.19844 0.25231,-0.19844 0.13823,0 0.76331,-0.34449 1.38907,-0.76554 0.62575,-0.42104 1.61399,-1.0242 2.19607,-1.34033 0.58209,-0.31614 1.41552,-0.78855 1.85209,-1.04979 1.87927,-1.12458 5.50821,-3.19434 5.6007,-3.19434 0.0554,0 0.84203,-0.45778 1.74797,-1.01729 0.90594,-0.55952 3.07591,-1.82687 4.82216,-2.81635 3.89967,-2.20966 4.18297,-2.37271 7.14375,-4.11132 1.30969,-0.76907 2.8575,-1.66178 3.43958,-1.9838 0.58209,-0.32201 2.1299,-1.21203 3.43959,-1.97782 3.33909,-1.95238 7.26252,-4.23148 8.20208,-4.76453 0.89469,-0.5076 8.03725,-4.62301 13.22917,-7.6224 5.76811,-3.33227 6.48229,-3.72838 6.48229,-3.59535 0,0.0705 0.23207,-0.0848 0.51572,-0.3451 0.28365,-0.26033 1.09753,-0.79662 1.80863,-1.19177 l 1.29291,-0.71844 3.2846,1.87127 c 1.80653,1.0292 3.64178,2.09096 4.07835,2.35947 0.43656,0.26851 1.86531,1.09094 3.175,1.82762 1.30968,0.73668 2.8575,1.61717 3.43958,1.95666 4.57698,2.66938 6.78739,3.94957 9.65729,5.59316 1.81901,1.04175 4.79558,2.76768 6.61459,3.8354 4.55499,2.67368 5.36341,3.13997 5.82083,3.35739 0.21828,0.10376 1.23031,0.68057 2.24896,1.28181 1.01864,0.60124 2.38786,1.39247 3.04271,1.7583 0.65484,0.36583 2.38125,1.35781 3.83645,2.20441 1.45521,0.8466 4.55084,2.63426 6.87917,3.97259 2.32833,1.33833 4.88818,2.82404 5.68854,3.30159 0.80037,0.47754 1.93146,1.13227 2.51354,1.45494 3.23253,1.79193 5.42396,3.12177 5.42396,3.29146 0,0.10591 -1.51804,1.06177 -3.37343,2.12413 -1.8554,1.06236 -3.73063,2.13907 -4.16719,2.3927 -0.43656,0.25363 -1.50813,0.8727 -2.38125,1.37573 -4.03174,2.32277 -10.66083,6.1572 -11.37709,6.58079 -1.00855,0.59646 -4.46257,2.58851 -8.20208,4.73042 -1.60073,0.91686 -3.6713,2.12425 -4.60127,2.68309 -0.92997,0.55884 -1.79317,0.95283 -1.91823,0.87554 -0.12505,-0.0773 -0.22737,-0.0257 -0.22737,0.11453 0,0.234 -0.61659,0.64066 -3.175,2.09402 -0.50933,0.28933 -1.76685,1.01465 -2.7945,1.61182 -2.28674,1.32884 -3.31531,1.70096 -7.46452,2.70057 -6.36314,1.53298 -12.50665,2.10743 -19.24203,1.79923 z m 27.20124,-9.24152 c 0.17765,-0.6793 0.0667,-0.64403 -0.44877,0.14263 -0.33523,0.51163 -0.3475,0.62253 -0.0565,0.51087 0.20442,-0.0784 0.4318,-0.37252 0.50527,-0.6535 z m -18.24639,-1.44832 c -0.0862,-0.22455 -0.21342,-0.35154 -0.28278,-0.28218 -0.0694,0.0693 -0.0476,0.25308 0.0483,0.40829 0.2609,0.42213 0.41338,0.34012 0.23448,-0.12611 z m -13.72865,-3.80676 c 0.0837,-0.13547 0.0312,-0.32109 -0.11667,-0.41249 -0.1479,-0.0914 -0.2689,0.0194 -0.2689,0.2463 0,0.46475 0.15876,0.53318 0.38557,0.16619 z m 24.74985,-1.19329 c 0,-0.0642 -0.11907,-0.19026 -0.26459,-0.2802 -0.14552,-0.0899 -0.26458,-0.0374 -0.26458,0.11668 0,0.1541 0.11906,0.28019 0.26458,0.28019 0.14552,0 0.26459,-0.0525 0.26459,-0.11667 z m -12.7,-1.35415 c 0,-0.22687 -0.12101,-0.3377 -0.2689,-0.2463 -0.1479,0.0914 -0.2004,0.27702 -0.11668,0.41249 0.22681,0.36699 0.38558,0.29856 0.38558,-0.16619 z m -52.22765,-10.89294 c -0.26896,-0.26895 -0.49087,0.13597 -0.2702,0.49302 0.1667,0.26973 0.22902,0.26993 0.31864,0.001 0.0613,-0.18383 0.0395,-0.40617 -0.0484,-0.49409 z m 51.14976,-3.35539 c 0.18283,-0.22029 0.20844,-0.43598 0.0625,-0.52619 -0.13604,-0.0841 -0.30927,0.0839 -0.38495,0.37332 -0.16304,0.62345 -0.0949,0.65576 0.32247,0.15287 z m -6.41864,-2.658 c 0,-0.21202 -0.16151,-0.44747 -0.3589,-0.52321 -0.28152,-0.10803 -0.29853,-0.0249 -0.0789,0.38549 0.33356,0.62326 0.43779,0.65605 0.43779,0.13772 z m -4.01285,-5.69993 c 0.0899,-0.14552 0.0374,-0.26458 -0.11668,-0.26458 -0.15411,0 -0.2802,0.11906 -0.2802,0.26458 0,0.14552 0.0525,0.26458 0.11668,0.26458 0.0642,0 0.19026,-0.11906 0.2802,-0.26458 z m 1.45521,-1.32292 c -0.51815,-0.33485 -0.86841,-0.33485 -0.66146,0 0.0899,0.14553 0.36486,0.26276 0.61093,0.26054 0.38557,-0.004 0.39255,-0.0395 0.0505,-0.26054 z m 44.11376,-0.9536 c -0.0879,-0.0879 -0.31613,-0.0973 -0.50712,-0.0209 -0.21107,0.0845 -0.14837,0.14715 0.15985,0.15985 0.27892,0.0115 0.43519,-0.0511 0.34727,-0.13897 z m -44.77522,-2.75056 c -0.0899,-0.14552 -0.28258,-0.26459 -0.4281,-0.26459 -0.14552,0 -0.191,0.11907 -0.10107,0.26459 0.0899,0.14552 0.28259,0.26458 0.42811,0.26458 0.14552,0 0.191,-0.11906 0.10106,-0.26458 z m -23.41563,-1.5875 c 0,-0.14552 -0.0525,-0.26459 -0.11667,-0.26459 -0.0642,0 -0.19026,0.11907 -0.2802,0.26459 -0.0899,0.14552 -0.0374,0.26458 0.11668,0.26458 0.1541,0 0.28019,-0.11906 0.28019,-0.26458 z m 34.52626,-3.17197 c 0.0927,-0.14998 -0.0135,-0.19434 -0.24897,-0.10399 -0.45837,0.1759 -0.54224,0.36554 -0.16165,0.36554 0.13693,0 0.32171,-0.1177 0.41062,-0.26155 z m 4.3675,-0.5322 c 0,-0.14552 -0.20836,-0.26276 -0.46303,-0.26053 -0.39569,0.003 -0.40531,0.0413 -0.0661,0.26053 0.49932,0.32269 0.52917,0.32269 0.52917,0 z m -13.49376,-0.91043 c 0,-0.0642 -0.11906,-0.19026 -0.26458,-0.28019 -0.14552,-0.0899 -0.26458,-0.0374 -0.26458,0.11667 0,0.15411 0.11906,0.2802 0.26458,0.2802 0.14552,0 0.26458,-0.0525 0.26458,-0.11668 z m 15.21355,-7.29165 c 0.0899,-0.14552 0.0445,-0.26459 -0.10107,-0.26459 -0.14552,0 -0.33816,0.11907 -0.4281,0.26459 -0.0899,0.14552 -0.0445,0.26458 0.10106,0.26458 0.14552,0 0.33817,-0.11906 0.42811,-0.26458 z"
           id="path870"
           inkscape:connector-curvature="0" />
      </g>
    </g>
  </g>
</svg>
