<?xml version="1.0" encoding="UTF-8" standalone="no"?>
<svg
   xmlns:dc="http://purl.org/dc/elements/1.1/"
   xmlns:cc="http://creativecommons.org/ns#"
   xmlns:rdf="http://www.w3.org/1999/02/22-rdf-syntax-ns#"
   xmlns:svg="http://www.w3.org/2000/svg"
   xmlns="http://www.w3.org/2000/svg"
   id="svg1479"
   version="1.1"
   viewBox="0 0 26.458333 26.458334"
   height="100"
   width="100">
  <defs
     id="defs1473" />
  <metadata
     id="metadata1476">
    <rdf:RDF>
      <cc:Work
         rdf:about="">
        <dc:format>image/svg+xml</dc:format>
        <dc:type
           rdf:resource="http://purl.org/dc/dcmitype/StillImage" />
        <dc:title></dc:title>
      </cc:Work>
    </rdf:RDF>
  </metadata>
  <g
     transform="translate(0,-270.54165)"
     id="layer1">
    <g
       transform="matrix(4.2890776,0,0,4.2890776,-1575.9315,-519.71221)"
       id="g4410">
      <path
         style="fill:#ff00fc;fill-opacity:1;stroke:#ff00fc;stroke-width:0.5;stroke-miterlimit:4;stroke-dasharray:none;stroke-opacity:1"
         d="m 372.2487,185.3505 c -0.23874,-0.36126 -0.70455,-0.45053 -1.05311,-0.25139 -0.31412,-0.33538 -0.84349,-0.33137 -1.15458,-2.7e-4 -0.50261,-0.28797 -1.1586,0.0539 -1.17949,0.64805 -0.49238,-0.11554 -0.97033,0.25316 -0.97033,0.75862 v 0.60699 c 0,0.34894 0.15218,0.68159 0.41756,0.91265 l 1.04136,0.90676 c 0.0453,0.0394 0.0331,0.0594 0.0331,0.35067 0,0.18835 0.15269,0.34104 0.34105,0.34104 h 2.68571 c 0.18836,0 0.34106,-0.15269 0.34106,-0.34104 0,-0.25059 -0.0109,-0.32767 0.0424,-0.45156 l 0.45653,-1.06209 c 0.0649,-0.1511 0.0978,-0.31092 0.0978,-0.475 v -1.21969 c 0,-0.56314 -0.57885,-0.94493 -1.09919,-0.72377 z m 0.58762,1.94346"
         id="path4412" />
      <path
         id="path4414"
         d="m 371.91258,185.66216 c -0.23195,-0.35099 -0.68452,-0.43772 -1.02316,-0.24424 -0.30519,-0.32584 -0.81951,-0.32195 -1.12175,-2.6e-4 -0.48832,-0.27978 -1.12564,0.0523 -1.14594,0.62961 -0.47838,-0.11225 -0.94274,0.24596 -0.94274,0.73705 v 0.58972 c 0,0.33902 0.14786,0.66221 0.40569,0.8867 l 1.01174,0.88097 c 0.044,0.0383 0.0322,0.0577 0.0322,0.3407 0,0.18299 0.14835,0.33134 0.33135,0.33134 h 2.60933 c 0.183,0 0.33135,-0.14835 0.33135,-0.33134 0,-0.24347 -0.0105,-0.31835 0.0412,-0.43872 l 0.44354,-1.03189 c 0.0631,-0.1468 0.0951,-0.30207 0.0951,-0.46149 v -1.18499 c 0,-0.54713 -0.56239,-0.91806 -1.06792,-0.70319 z m 0.5709,1.88819"
         style="fill:none;stroke:#000000;stroke-width:0.5;stroke-miterlimit:4;stroke-dasharray:none;stroke-opacity:1" />
    </g>
  </g>
</svg>
