doc/threat_model: this is about mat2, not mat

9 jobs for master in 2 minutes and 15 seconds (queued for 2 seconds)
Status Job ID Name Coverage
  Linting
passed #101407
linting:bandit

00:00:17

passed #101410
linting:mypy

00:00:17

passed #101409
linting:pyflakes

00:00:17

passed #101408
linting:pylint

00:00:26

 
  Test
passed #101411
tests:archlinux

00:01:22

passed #101412
tests:debian

00:01:20

98.0%
failed #101413
allowed to fail
tests:debian_with_bubblewrap

00:01:46

passed #101414
tests:fedora

00:01:24

failed #101415
allowed to fail
tests:gentoo

00:01:15

 
Name Stage Failure
failed
tests:debian_with_bubblewrap Test
  File "/usr/lib/python3.7/subprocess.py", line 487, in run
output=stdout, stderr=stderr)
subprocess.CalledProcessError: Command '['/usr/bin/bwrap', '--ro-bind', '/usr', '/usr', '--ro-bind', '/lib', '/lib', '--ro-bind', '/lib64', '/lib64', '--ro-bind', '/bin', '/bin', '--ro-bind', '/sbin', '/sbin', '--ro-bind', '/builds/jvoisin/mat2', '/builds/jvoisin/mat2', '--ro-bind', '/etc/ld.so.cache', '/etc/ld.so.cache', '--dev', '/dev', '--chdir', '/builds/jvoisin/mat2', '--unshare-all', '--new-session', '--ro-bind', '/tmp/tmp1q1n1f3k/tests/data/dirty.jpg', '/tmp/tmp1q1n1f3k/tests/data/dirty.jpg', '/usr/bin/exiftool', '-json', '/tmp/tmp1q1n1f3k/./tests/data/dirty.jpg']' returned non-zero exit status 1.

----------------------------------------------------------------------
Ran 128 tests in 93.327s

FAILED (errors=2)
ERROR: Job failed: exit code 1
failed
tests:gentoo Test
  File "/builds/jvoisin/mat2/tests/test_libmat2.py", line 137, in test_flac
self.assertEqual(meta['Cover 0'], {'Comment': 'Created with GIMP'})
AssertionError: 'harmful data' != {'Comment': 'Created with GIMP'}

----------------------------------------------------------------------
Ran 128 tests in 62.302s

FAILED (failures=12, errors=10)
ERROR: Job failed: exit code 1