Make the CLI a bit more parallel

9 jobs for parallel in 2 minutes and 12 seconds (queued for 1 second)
Status Job ID Name Coverage
  Linting
passed #98984
linting:bandit

00:00:15

passed #98987
linting:mypy

00:00:16

passed #98986
linting:pyflakes

00:00:15

passed #98985
linting:pylint

00:00:22

 
  Test
passed #98988
tests:archlinux

00:01:21

passed #98989
tests:debian

00:01:22

98.0%
failed #98990
allowed to fail
tests:debian_with_bubblewrap

00:01:48

passed #98991
tests:fedora

00:01:22

failed #98992
allowed to fail
tests:gentoo

00:01:14

 
Name Stage Failure
failed
tests:debian_with_bubblewrap Test
  File "/usr/lib/python3.7/subprocess.py", line 487, in run
output=stdout, stderr=stderr)
subprocess.CalledProcessError: Command '['/usr/bin/bwrap', '--ro-bind', '/usr', '/usr', '--ro-bind', '/lib', '/lib', '--ro-bind', '/lib64', '/lib64', '--ro-bind', '/bin', '/bin', '--ro-bind', '/sbin', '/sbin', '--ro-bind', '/builds/jvoisin/mat2', '/builds/jvoisin/mat2', '--ro-bind', '/etc/ld.so.cache', '/etc/ld.so.cache', '--dev', '/dev', '--chdir', '/builds/jvoisin/mat2', '--unshare-all', '--new-session', '--ro-bind', '/tmp/tmpq5_2g92p/tests/data/dirty.jpg', '/tmp/tmpq5_2g92p/tests/data/dirty.jpg', '/usr/bin/exiftool', '-json', '/tmp/tmpq5_2g92p/./tests/data/dirty.jpg']' returned non-zero exit status 1.

----------------------------------------------------------------------
Ran 128 tests in 92.858s

FAILED (errors=2)
ERROR: Job failed: exit code 1
failed
tests:gentoo Test
  File "/builds/jvoisin/mat2/tests/test_libmat2.py", line 137, in test_flac
self.assertEqual(meta['Cover 0'], {'Comment': 'Created with GIMP'})
AssertionError: 'harmful data' != {'Comment': 'Created with GIMP'}

----------------------------------------------------------------------
Ran 128 tests in 61.282s

FAILED (failures=12, errors=10)
ERROR: Job failed: exit code 1