Please mypy wrt. the last two commits

9 jobs for master in 2 minutes and 24 seconds (queued for 3 seconds)
Status Job ID Name Coverage
  Linting
passed #97220
linting:bandit

00:00:20

passed #97223
linting:mypy

00:00:27

passed #97222
linting:pyflakes

00:00:23

passed #97221
linting:pylint

00:00:28

 
  Test
passed #97224
tests:archlinux

00:01:27

passed #97225
tests:debian

00:01:34

98.0%
failed #97226
allowed to fail
tests:debian_with_bubblewrap

00:01:54

passed #97227
tests:fedora

00:01:34

failed #97228
allowed to fail
tests:gentoo

00:01:28

 
Name Stage Failure
failed
tests:debian_with_bubblewrap Test
  File "/usr/lib/python3.7/subprocess.py", line 487, in run
output=stdout, stderr=stderr)
subprocess.CalledProcessError: Command '['/usr/bin/bwrap', '--ro-bind', '/usr', '/usr', '--ro-bind', '/lib', '/lib', '--ro-bind', '/lib64', '/lib64', '--ro-bind', '/bin', '/bin', '--ro-bind', '/sbin', '/sbin', '--ro-bind', '/builds/jvoisin/mat2', '/builds/jvoisin/mat2', '--ro-bind', '/etc/ld.so.cache', '/etc/ld.so.cache', '--dev', '/dev', '--chdir', '/builds/jvoisin/mat2', '--unshare-all', '--new-session', '--ro-bind', '/tmp/tmpo_d_kmw3/tests/data/dirty.jpg', '/tmp/tmpo_d_kmw3/tests/data/dirty.jpg', '/usr/bin/exiftool', '-json', '/tmp/tmpo_d_kmw3/./tests/data/dirty.jpg']' returned non-zero exit status 1.

----------------------------------------------------------------------
Ran 128 tests in 94.186s

FAILED (errors=2)
ERROR: Job failed: exit code 1
failed
tests:gentoo Test
  File "/builds/jvoisin/mat2/tests/test_libmat2.py", line 137, in test_flac
self.assertEqual(meta['Cover 0'], {'Comment': 'Created with GIMP'})
AssertionError: 'harmful data' != {'Comment': 'Created with GIMP'}

----------------------------------------------------------------------
Ran 128 tests in 60.202s

FAILED (failures=12, errors=10)
ERROR: Job failed: exit code 1