Please pylint

9 jobs for master in 4 minutes and 3 seconds (queued for 1 second)
Status Job ID Name Coverage
  Linting
passed #97202
linting:bandit

00:00:22

passed #97205
linting:mypy

00:00:22

passed #97204
linting:pyflakes

00:00:27

passed #97203
linting:pylint

00:00:33

 
  Test
passed #97206
tests:archlinux

00:01:25

passed #97207
tests:debian

00:01:31

98.0%
failed #97208
allowed to fail
tests:debian_with_bubblewrap

00:01:59

passed #97209
tests:fedora

00:01:26

failed #97210
allowed to fail
tests:gentoo

00:03:27

 
Name Stage Failure
failed
tests:gentoo Test
  File "/builds/jvoisin/mat2/tests/test_libmat2.py", line 140, in test_flac
self.assertEqual(meta['Cover 0'], {'Comment': 'Created with GIMP'})
AssertionError: 'harmful data' != {'Comment': 'Created with GIMP'}

----------------------------------------------------------------------
Ran 128 tests in 48.665s

FAILED (failures=12, errors=10)
ERROR: Job failed: exit code 1
failed
tests:debian_with_bubblewrap Test
  File "/usr/lib/python3.7/subprocess.py", line 487, in run
output=stdout, stderr=stderr)
subprocess.CalledProcessError: Command '['/usr/bin/bwrap', '--ro-bind', '/usr', '/usr', '--ro-bind', '/lib', '/lib', '--ro-bind', '/lib64', '/lib64', '--ro-bind', '/bin', '/bin', '--ro-bind', '/sbin', '/sbin', '--ro-bind', '/builds/jvoisin/mat2', '/builds/jvoisin/mat2', '--ro-bind', '/etc/ld.so.cache', '/etc/ld.so.cache', '--dev', '/dev', '--chdir', '/builds/jvoisin/mat2', '--unshare-all', '--new-session', '--ro-bind', '/tmp/tmpqsmz8e9a/tests/data/dirty.jpg', '/tmp/tmpqsmz8e9a/tests/data/dirty.jpg', '/usr/bin/exiftool', '-json', '/tmp/tmpqsmz8e9a/./tests/data/dirty.jpg']' returned non-zero exit status 1.

----------------------------------------------------------------------
Ran 128 tests in 92.585s

FAILED (errors=2)
ERROR: Job failed: exit code 1