Merge branch 'fz/mat2-pool_threading' into HEAD

9 jobs for pool_threading in 4 minutes and 5 seconds (queued for 2 seconds)
latest
Status Job ID Name Coverage
  Linting
passed #96795
linting:bandit

00:00:14

passed #96798
linting:mypy

00:00:19

passed #96797
linting:pyflakes

00:00:14

passed #96796
linting:pylint

00:00:24

 
  Test
failed #96799
tests:archlinux

00:02:55

failed #96800
tests:debian

00:02:43

failed #96801
allowed to fail
tests:debian_with_bubblewrap

00:02:06

failed #96802
tests:fedora

00:03:39

failed #96803
allowed to fail
tests:gentoo

00:02:34

 
Name Stage Failure
failed
tests:fedora Test
AssertionError: 0 != 255

----------------------------------------------------------------------
Ran 129 tests in 81.051s

FAILED (failures=1, errors=2)
Test failed: <unittest.runner.TextTestResult run=129 errors=2 failures=1>
error: Test failed: <unittest.runner.TextTestResult run=129 errors=2 failures=1>
ERROR: Job failed: exit code 1
failed
tests:archlinux Test
AssertionError: 0 != 255

----------------------------------------------------------------------
Ran 129 tests in 92.575s

FAILED (failures=1, errors=2)
Test failed: <unittest.runner.TextTestResult run=129 errors=2 failures=1>
error: Test failed: <unittest.runner.TextTestResult run=129 errors=2 failures=1>
ERROR: Job failed: exit code 1
failed
tests:debian Test
  File "/builds/fz/mat2/tests/test_climat2.py", line 59, in test_zero
self.assertEqual(0, ret)
AssertionError: 0 != 255

----------------------------------------------------------------------
Ran 127 tests in 93.338s

FAILED (failures=1)
ERROR: Job failed: exit code 1
failed
tests:gentoo Test There is an unknown failure, please try again
  File "/builds/fz/mat2/tests/test_climat2.py", line 59, in test_zero
self.assertEqual(0, ret)
AssertionError: 0 != 255

----------------------------------------------------------------------
Ran 127 tests in 141.096s

FAILED (failures=1, errors=2)
ERROR: Job failed: exit code 1
failed
tests:debian_with_bubblewrap Test
  File "/builds/fz/mat2/tests/test_climat2.py", line 59, in test_zero
self.assertEqual(0, ret)
AssertionError: 0 != 255

----------------------------------------------------------------------
Ran 127 tests in 55.910s

FAILED (failures=9, errors=43)
ERROR: Job failed: exit code 1