more typos

9 jobs for fz/mat2-pool_threading in 2 minutes and 50 seconds (queued for 2 seconds)
latest
Status Job ID Name Coverage
  Linting
passed #96786
linting:bandit

00:00:15

passed #96789
linting:mypy

00:00:23

passed #96788
linting:pyflakes

00:00:14

passed #96787
linting:pylint

00:00:26

 
  Test
failed #96790
tests:archlinux

00:00:15

failed #96791
tests:debian

00:01:47

failed #96792
tests:debian_with_bubblewrap

00:02:20

failed #96793
tests:fedora

00:00:15

failed #96794
allowed to fail
tests:gentoo

00:02:22

 
Name Stage Failure
failed
tests:gentoo Test There is an unknown failure, please try again
  File "/builds/fz/mat2/tests/test_climat2.py", line 56, in test_zero
self.assertEqual(0, ret)
AssertionError: 0 != 255

----------------------------------------------------------------------
Ran 125 tests in 127.269s

FAILED (failures=1, errors=2)
ERROR: Job failed: exit code 1
failed
tests:debian_with_bubblewrap Test There is an unknown failure, please try again
  File "/builds/fz/mat2/tests/test_climat2.py", line 56, in test_zero
self.assertEqual(0, ret)
AssertionError: 0 != 255

----------------------------------------------------------------------
Ran 125 tests in 124.825s

FAILED (failures=1, errors=2)
ERROR: Job failed: exit code 1
failed
tests:debian Test There is an unknown failure, please try again
  File "/builds/fz/mat2/tests/test_climat2.py", line 56, in test_zero
self.assertEqual(0, ret)
AssertionError: 0 != 255

----------------------------------------------------------------------
Ran 125 tests in 91.114s

FAILED (failures=1)
ERROR: Job failed: exit code 1
failed
tests:fedora Test There is an unknown failure, please try again
    __load_all_parsers()
File "/builds/fz/mat2/libmat2/parser_factory.py", line 31, in __load_all_parsers
importlib.import_module('.' + name, package='libmat2')
File "/usr/lib64/python3.7/importlib/__init__.py", line 127, in import_module
return _bootstrap._gcd_import(name[level:], package, level)
File "/builds/fz/mat2/libmat2/epub.py", line 8, in <module>
class EPUBParser(archive.ZipParser):
AttributeError: module 'libmat2.archive' has no attribute 'ZipParser'
ERROR: Job failed: exit code 1
failed
tests:archlinux Test There is an unknown failure, please try again
    __load_all_parsers()
File "/builds/fz/mat2/libmat2/parser_factory.py", line 31, in __load_all_parsers
importlib.import_module('.' + name, package='libmat2')
File "/usr/lib/python3.7/importlib/__init__.py", line 127, in import_module
return _bootstrap._gcd_import(name[level:], package, level)
File "/builds/fz/mat2/libmat2/epub.py", line 8, in <module>
class EPUBParser(archive.ZipParser):
AttributeError: module 'libmat2.archive' has no attribute 'ZipParser'
ERROR: Job failed: exit code 1