typo

9 jobs for patch-1 in 6 minutes and 56 seconds (queued for 1 second)
latest
Status Job ID Name Coverage
  Linting
passed #96074
linting:bandit

00:00:57

passed #96077
linting:mypy

00:00:59

passed #96076
linting:pyflakes

00:00:47

passed #96075
linting:pylint

00:00:58

 
  Test
passed #96078
tests:archlinux

00:04:38

passed #96079
tests:debian

00:02:09

failed #96080
tests:debian_with_bubblewrap

00:01:37

passed #96081
tests:fedora

00:05:55

failed #96082
allowed to fail
tests:gentoo

00:03:38

 
Name Stage Failure
failed
tests:gentoo Test
  File "/builds/fz/mat2/tests/test_climat2.py", line 130, in test_png
self.assertIn(b'Comment: This is a comment, be careful!', stdout)
AssertionError: b'Comment: This is a comment, be careful!' not found in b''

----------------------------------------------------------------------
Ran 125 tests in 38.944s

FAILED (failures=8, errors=42)
ERROR: Job failed: exit code 1
failed
tests:debian_with_bubblewrap Test
  File "/builds/fz/mat2/tests/test_climat2.py", line 130, in test_png
self.assertIn(b'Comment: This is a comment, be careful!', stdout)
AssertionError: b'Comment: This is a comment, be careful!' not found in b''

----------------------------------------------------------------------
Ran 125 tests in 44.717s

FAILED (failures=8, errors=42)
ERROR: Job failed: exit code 1