<?xml version="1.0" encoding="UTF-8"?>
<svg width="200" height="100" version="1.1" viewBox="0 0 200 100" xmlns="http://www.w3.org/2000/svg">
 <defs>
  <filter id="a" x="-.10898" y="-.11344" width="1.2506" height="1.2597" color-interpolation-filters="sRGB">
   <feFlood flood-color="rgb(0,0,0)" flood-opacity=".49804" result="flood"/>
   <feComposite in="flood" in2="SourceGraphic" operator="in" result="composite1"/>
   <feGaussianBlur in="composite1" result="blur" stdDeviation="1.8"/>
   <feOffset dx="3" dy="3" result="offset"/>
   <feComposite in="SourceGraphic" in2="offset" result="composite2"/>
  </filter>
 </defs>
 <path d="m125.17 84.202-26.711-10.15-24.031 14.947 2.0069-27.037-22.536-16.883 27.951-6.559 10.103-25.38 15.268 22.983 28.78 1.1964-18.516 20.763z" fill="#ad7fa8" filter="url(#a)" stroke="#5c3566" stroke-width="3.9992"/>
</svg>
