<?xml version="1.0" encoding="UTF-8" standalone="no"?>
<svg
   xmlns:dc="http://purl.org/dc/elements/1.1/"
   xmlns:cc="http://creativecommons.org/ns#"
   xmlns:rdf="http://www.w3.org/1999/02/22-rdf-syntax-ns#"
   xmlns:svg="http://www.w3.org/2000/svg"
   xmlns="http://www.w3.org/2000/svg"
   xmlns:sodipodi="http://sodipodi.sourceforge.net/DTD/sodipodi-0.dtd"
   xmlns:inkscape="http://www.inkscape.org/namespaces/inkscape"
   width="200"
   height="117"
   version="1.1"
   viewBox="0 0 200 117"
   id="svg21"
   sodipodi:docname="lightning-fist.svg"
   inkscape:version="0.92.3 (2405546, 2018-03-11)">
  <metadata
     id="metadata2">
    <rdf:RDF>
      <cc:Work
         rdf:about="">
        <dc:format>image/svg+xml</dc:format>
        <dc:type
           rdf:resource="http://purl.org/dc/dcmitype/StillImage" />
        <dc:title></dc:title>
      </cc:Work>
    </rdf:RDF>
  </metadata>
  <defs
     id="defs9">
    <linearGradient
       id="a"
       x1="43.571999"
       x2="41.201"
       y1="220.31"
       y2="227.12"
       gradientUnits="userSpaceOnUse">
      <stop
         stop-color="#ffd900"
         offset="0"
         id="stop4" />
      <stop
         stop-color="#fb7300"
         stop-opacity=".98"
         offset="1"
         id="stop6" />
    </linearGradient>
  </defs>
  <g
     transform="matrix(3.7649108,0,0,3.806317,-66.893718,-807.00937)"
     id="g19"
     style="stroke-width:0.26416191">
    <path
       transform="matrix(0.26458,0,0,0.26458,0,263.13)"
       d="m 154.66,-193.18 -10.61,5.443 -4.422,-1.232 -15.338,3.465 -3.824,11.365 -7.057,1.37 6.3,-10.64 -52.555,1.7325 24.612,9.7385 -6.033,7.045 31.42,13.443 1.576,38.314 -15.34,36.134 h 55.432 l 5.445,-12.16 35.613,-15.05 5.492,-13.137 32.842,13.73 -2.324,-17.33 31.37,16.5 0.674,-33.36 -48.615,-12.914 2.152,14.79 -9.086,-4.107 0.64,-3.746 -2.934,-1.842 7.688,-18.393 -7.873,-10.7 -7.73,-2.922 -4.668,0.826 -1.262,-7.318 -16.29,-6.81 -10.166,0.69 z"
       id="path11"
       inkscape:connector-curvature="0"
       style="stroke-width:0.26416191" />
    <path
       d="m 69.047,228.35 -9.032,-3.204 0.262,3.866 -4.27,-1.703 -1.076,3.552 6.505,2.8 -0.14,-4.55 7.85,3.7 z m -40.19,-12.472 -6.016,-0.065 3.505,1.384 -1.376,2.12 7.578,3.168 1.125,-1.326 -1.527,-2.6 -4.236,-0.22 z"
       id="path13"
       inkscape:connector-curvature="0"
       style="fill:url(#a);stroke-width:0.26416191" />
    <path
       d="m 45.392,225.16 -0.827,3.737 c 0,0 0.66,0.766 2.787,0.757 l 2.9,0.073 c 0,0 -0.105,0.446 -1.172,0.654 -1.067,0.208 -2.782,-0.183 -2.782,-0.183 0,0 0.463,0.847 1.68,0.866 l 1.652,-0.044 c 0,0 -0.523,1.25 -1.444,1.1 -0.921,-0.15 -2.803,-1.5 -3.875,-1.865 -1.072,-0.365 -1.936,0.334 -2.296,1 -0.36,0.666 -0.716,2.885 -0.716,2.885 0,0 -0.502,-1.925 -0.066,-2.967 0.436,-1.042 0.935,-1.65 0.935,-1.65 l -1.65,-0.935 -0.27,-1.5 -3.608,-1.284 c 0,0 -1.187,2.8 -0.563,5.012 a 22,22 0 0 0 1.589,4.012 l -3.002,7.925 h 5.917 l 1.787,-4.325 -2.94,-2.536 c 0,0 2.665,1.44 4.317,1.396 1.652,-0.044 6.435,-1.72 7.427,-2.53 0.992,-0.81 3.464,-8.68 3.464,-8.68 0,0 -2.73,0.084 -5.314,-0.18 -2.584,-0.264 -3.934,-0.746 -3.934,-0.746 z m 6.808,-7.7 c 0,0 1.403,-0.23 2.62,0.768 1.217,0.998 1.517,1.45 1.517,1.45 l -1.918,4.588 c 0,0 -0.8,0.156 -2.046,0.206 -1.246,0.05 -1.94,-0.24 -1.94,-0.24 l 1.402,-4.722 0.368,-2.05 z m -4.337,-3.7 2.642,1.104 c 0,0 0.6,1.716 0.257,3.292 -0.343,1.576 -2.053,6.083 -2.053,6.083 0,0 -1.05,-0.03 -2.3,-0.385 -1.25,-0.355 -1.628,-0.6 -1.628,-0.6 l 2.187,-6.6 0.884,-2.897 z m -5.998,-0.302 2.585,0.264 c 0,0 1.163,1.7 0.627,3.774 -0.536,2.074 -1.924,4.994 -1.924,4.994 l -3.43,-0.78 1.844,-6.17 0.298,-2.08 z m -6.435,1.72 c 0,0 0.893,-0.77 1.896,-0.432 1.003,0.338 1.47,0.778 1.47,0.778 l -0.783,5.4 c 0,0 -0.255,0.22 -1.304,0.2 -1.049,-0.02 -1.576,-0.332 -1.576,-0.332 l 0.126,-3.622 0.17,-1.97 z"
       id="path15"
       inkscape:connector-curvature="0"
       style="fill:#c4a43f;stroke-width:0.26416191" />
    <path
       d="m 38.3,214.36 2.296,-1 c 0,0 0.515,1.113 0.276,2.075 -0.239,0.962 -1.8,4.478 -1.8,4.478 0,0 0.892,-4.282 0.492,-4.694 -0.4,-0.412 -1.274,-0.86 -1.274,-0.86 z m -3.42,0.367 -1.35,0.497 -0.773,2.045 1.487,2.5 0.12,-3.216 z m 11.156,1.643 0.936,-2.63 -1.385,-0.008 z m -1.743,8.662 -0.787,3.836 -2.085,-0.872 0.56,-3.685 z m -2.728,-1.876 -2.468,-0.542 -1.504,2.23 2.6,0.838 0.8,-2.283 z m -3.888,-1.053 c 0,0 -0.66,0.214 -1.524,-0.065 l -1.2,-0.425 -0.906,1.58 2.166,1.07 z m -4.927,2.022 -0.127,9.094 1.007,0.9 -1.206,0.15 -3.644,8.48 h 4.726 l 2.707,-7.387 -1.147,-0.97 1.367,0.245 -1.426,-4.598 c -0.138,-0.6 -0.188,-1.188 -0.195,-1.7 -10e-4,-0.086 -0.687,-0.333 -0.687,-0.333 0,0 0.7,-0.124 0.695,-0.22 0.025,-0.622 0.098,-1.04 0.098,-1.04 l -0.886,-0.615 0.852,0.1 0.618,-1.1 z"
       id="path17"
       inkscape:connector-curvature="0"
       style="fill:#796621;stroke-width:0.26416191" />
  </g>
</svg>
